{"text_format":"1","workbook":"xlsx","n_sheets":10,"sheets":["Indice","2016","Continente","1989","1999","2009","2013","Evolução Estrutura","Sheet1","Evolução regional"],"not_rendered":{"charts":3,"images":4,"macros":1,"external_links":0,"defined_names":2,"comments":0,"pivot_tables":0},"unopened":[],"bounds":{"document_bytes":16777216,"sheet_cells":100000,"rows_first":2000,"rows_last":500,"rows_between":2000,"halvings":0,"cell_chars":16384,"cell_head_chars":4096},"cells_cut":0,"cells_raw":0,"read":"whole","date_system":"1900"}

{"sheet":"Indice","index":0,"n_rows":33,"n_cols":13,"rows_kept":33,"cut":false,"hidden":false,"merged":[]}
[]
[]
[]
[]
[]
[]
[]
[]
[]
[null,"Evolução Estrutural das Explorações Agrícolas do Continente 1989 - 2016"]
[]
[]
[null,null,null,null,null,null,null,null,null,null,null,null,"Acesso aos dados:"]
[]
[]
[]
[]
[]
[]
[]
[]
[]
[]
[]
[]
[]
[]
[]
[]
["Fonte"]
{"$rows_left_out":4}
{"sheet":"2016","index":1,"n_rows":68,"n_cols":10,"rows_kept":68,"cut":false,"hidden":true,"merged":[[34,0,34,1],[42,0,42,1],[43,0,43,1],[50,0,50,1],[0,0,0,1],[1,0,1,1],[6,0,6,1],[11,0,11,1],[21,0,21,1],[33,0,33,1]]}
[2016,null,"Continente","EDM","TM","BL","BI","LVT","ALE","ALG"]
["EXPLORAÇÕES (nº)",null,235774,39651,56228,39462,29065,31217,28424,11728]
["Explorações por Classe de SAU (nº)"]
["> 0 a <5 ha",null,165331,33094,34351,34558,20264,22478,12428,8157]
["5 a 50 ha",null,58861,6146,20836,4319,7444,7365,9442,3310]
["> 50 ha",null,10395,197,937,133,1348,1149,6388,243]
["SUPERFÍCIE TOTAL DAS EXPLORAÇÕES (ha)",null,4515890,376225,594141,234215,504569,493467,2142617,170655]
["Superfície agrícola utilizada",null,3513006,198415,454719,122929,356488,378010,1906874,95570]
["Matas e florestas sem culturas sob-coberto",null,822722,162497,119425,105016,110752,96072,180595,48364]
["Superfície agrícola não utilizada",null,96491,6743,11476,2597,30031,5421,15661,24563]
["Outras superfícies",null,83671,8570,8522,3673,7297,13964,39487,2158]
["SAU (ha)",null,3513006,198415,454719,122929,356488,378010,1906874,95570]
["SAU por Classe de SAU"]
["<5 ha",null,318159,59634,79476,59084,35827,42368,25978,15791]
["5 a 50 ha",null,798835,71077,260182,51131,113036,98359,161649,43402]
["> 50 ha",null,2396012,67705,115061,12713,207626,237284,1719247,36377]
["Composição da SAU"]
["Terras aráveis",null,1019186,72909,99396,72728,79580,157295,510930,26349]
["Horta familiar",null,15690,2559,4466,2747,2519,1580,1238,581]
["Culturas permanentes",null,700353,29177,189595,28607,66727,94932,243467,47847]
["Pastagens permanentes",null,1777776,93771,161262,18847,207663,124204,1151238,20792]
["Cultura temporárias(1) (ha)"]
["Total",null,853885,114173,69794,85038,67826,133793,371845,11416]
["Cereais para grão",null,254957,17187,25639,30616,11297,44934,122365,2918]
["Leguminosas secas para grão",null,18043,878,861,1615,1452,394,12693,150]
["Prados temporários",null,91874,9773,7084,3937,6588,5274,56132,3088]
["Culturas forrageiras",null,406626,82244,32212,43275,47238,42073,155461,4124]
["Batata",null,10953,1097,3191,1771,784,3784,197,129]
["Beterraba sacarina",null,"","","","","","","",""]
["Culturas industriais",null,19837,"",50,176,30,3542,15996,43]
{"$rows_left_out":39}
{"sheet":"Continente","index":2,"n_rows":132,"n_cols":18,"rows_kept":132,"cut":false,"hidden":true,"merged":[[60,0,60,3],[68,0,68,3],[69,0,69,3],[84,0,84,3],[101,0,101,3],[73,0,73,3],[57,0,57,3],[0,0,0,3],[1,0,1,3],[16,0,16,3],[23,0,23,3],[44,0,44,3]]}
["Continente",null,null,null,1989,1993,1995,1997,1999,2003,2005,2007,2009,2013,2016]
["EXPLORAÇÕES (nº)"]
["Continente",null,null,null,550879,446146,412064,381793,382163,330656,297046,251547,278114,240527,235774]
["Entre Douro e Minho",null,null,null,111505,86967,79916,73048,67546,58757,52696,45848,49037,41601,39651]
["Trás-os-Montes",null,null,null,80551,75678,72248,70098,70006,64963,61649,56339,61804,57224,56228]
["Beira Litoral",null,null,null,125307,97459,88547,80217,79806,66060,58823,47542,49424,38356,39462]
["Beira Interior",null,null,null,60386,49533,45878,42841,48313,40788,35749,30357,33763,30862,29065]
["Ribatejo e Oeste",null,null,null,99938,78609,71430,64874,61615,52375,43850,33225,39875,31450,31217]
["Alentejo",null,null,null,47049,37491,36114,34722,35906,31830,29558,26032,31828,29478,28424]
["Algarve",null,null,null,26143,20409,17931,15993,18971,15883,14721,12204,12383,11556,11728]
[]
["Explorações por Classe de SAU (nº)"]
["> 0 a <5 ha",null,null,null,446184,343780,311525,286550,296010,249826,218948,179656,207062,170929,165331]
["5 a 50 ha",null,null,null,91424,91810,89783,84931,73258,69253,66865,61534,59667,58536,58861]
["> 50 ha",null,null,null,9050,9287,9601,9340,9612,9393,9971,9485,10047,10249,10395]
[]
["SUPERFÍCIE TOTAL DAS EXPLORAÇÕES (ha)"]
["Continente",null,null,null,5157213,4999731,4929405,4800054,5039569,4719438,4632024,4272503,4571531,4492242,4515890]
["Superfície agrícola utilizada",null,null,null,3879579,3821319,3800379,3700161,3736140,3578034,3552347,3357019,3542305,3517740,3513006]
["Matas e florestas sem culturas sob-coberto",null,null,null,965676,867336,803967,801053,997497,878078,838801,707750,837431,800482,822722]
["Superfície agrícola não utilizada",null,null,null,243534,215329,218610,208216,201084,180743,158346,134587,125283,99394,96491]
["Outras superfícies",null,null,null,68425,95747,106448,90624,104848,82584,82531,73146,66512,74626,83671]
[]
["SAU (ha)"]
["Continente",null,null,null,3879579,3821319,3800379,3700161,3736140,3578034,3552347,3357019,3542305,3517740,3513006]
["Entre Douro e Minho",null,null,null,289624,257684,239465,243450,215675,233702,232260,220371,211154,214554,198415]
["Trás-os-Montes",null,null,null,489133,493229,495965,462230,457881,467158,473530,474617,432873,432056,454719]
["Beira Litoral",null,null,null,231458,220532,205702,179896,169779,154781,151949,135986,125436,117387,122929]
["Beira Interior",null,null,null,433947,443745,441138,435052,418977,390252,384005,352257,337031,341976,356488]
["Ribatejo e Oeste",null,null,null,456544,498887,483831,494427,447853,381558,412093,349237,391006,370390,378010]
{"$rows_left_out":103}
{"sheet":"1989","index":3,"n_rows":69,"n_cols":10,"rows_kept":69,"cut":false,"hidden":true,"merged":[[34,0,34,1],[42,0,42,1],[43,0,43,1],[50,0,50,1],[69,0,69,1],[33,0,33,1],[0,0,0,1],[1,0,1,1],[6,0,6,1],[11,0,11,1],[21,0,21,1]]}
[1989,null,"Continente","EDM","TM","BL","BI","LVT","ALE","ALG"]
["EXPLORAÇÕES (nº)",null,550879,111505,80551,125307,60386,99938,47049,26143]
["Explorações por Classe de SAU (nº)"]
["> 0 a <5 ha",null,446184,101131,52952,118763,45225,83508,24909,19696]
["5 a 50 ha",null,91424,9925,26845,6156,14065,14154,14286,5993]
["> 50 ha",null,9050,128,660,62,1030,912,6039,219]
["SUPERFÍCIE TOTAL DAS EXPLORAÇÕES (ha)",null,5157213,464133,646279,425922,654570,684184,2007281,274845]
["Superfície agrícola utilizada",null,3879579,289624,489133,231458,433947,456544,1842094,136779]
["Matas e florestas sem culturas sob-coberto",null,965676,160966,73494,180590,168428,200065,124548,57585]
["Superfície agrícola não utilizada",null,243534,6418,70570,7357,47225,16262,17216,78486]
["Outras superfícies",null,68425,7126,13082,6517,4970,11313,23423,1995]
["SAU (ha)",null,3879579,289624,489133,231458,433947,456544,1842094,136779]
["SAU por Classe de SAU"]
["<5 ha",null,731458,161763,106275,167716,85372,128885,47458,33989]
["5 a 50 ha",null,1090803,81260,322576,55156,173795,160121,226550,71347]
["> 50 ha",null,2057316,46600,60282,8587,174780,167538,1568086,31444]
["Composição da SAU"]
["Terras aráveis",null,2330327,176575,222025,153148,215620,221287,1278436,63237]
["Horta familiar",null,31765,3816,8003,6505,5938,3593,2562,1348]
["Culturas permanentes",null,780966,45160,178449,56460,100177,171795,169037,59888]
["Pastagens permanentes",null,736521,64072,80656,15345,112212,59870,392059,12306]
["Cultura temporárias(1) (ha)"]
["Total",null,1869929,349411,184551,233010,189099,213333,660920,39606]
["Cereais para grão",null,896507,86367,110916,82590,81866,86699,424335,23734]
["Leguminosas secas para grão",null,80711,36503,2662,18789,8797,4804,6215,2942]
["Prados temporários",null,73865,17200,1974,2806,10970,10646,28544,1725]
["Culturas forrageiras",null,565460,164798,42634,96883,70781,59329,127413,3622]
["Batata",null,103652,19266,25778,26106,14276,14918,1742,1566]
["Beterraba sacarina",null,39,0,0,1,3,34,0,0]
["Culturas industriais",null,63960,68,100,384,1075,3267,58997,70]
{"$rows_left_out":40}
{"sheet":"1999","index":4,"n_rows":69,"n_cols":10,"rows_kept":69,"cut":false,"hidden":true,"merged":[[34,0,34,1],[42,0,42,1],[43,0,43,1],[50,0,50,1],[0,0,0,1],[1,0,1,1],[6,0,6,1],[11,0,11,1],[21,0,21,1],[33,0,33,1]]}
[1999,null,"Continente","EDM","TM","BL","BI","LVT","ALE","ALG"]
["EXPLORAÇÕES (nº)",null,382163,67546,70006,79806,48313,61615,35906,18971]
["Explorações por Classe de SAU (nº)"]
["> 0 a <5 ha",null,296010,60380,46124,74145,36091,48148,17140,13982]
["5 a 50 ha",null,73258,6830,22984,5061,10857,11370,11529,4627]
["> 50 ha",null,9612,152,722,88,1231,1027,6205,187]
["SUPERFÍCIE TOTAL DAS EXPLORAÇÕES (ha)",null,5039569,374832,637104,316646,618526,706000,2158882,227578]
["Superfície agrícola utilizada",null,3736140,215675,457881,169779,418977,447853,1924043,101932]
["Matas e florestas sem culturas sob-coberto",null,997497,133236,101797,131795,160471,220126,189789,60284]
["Superfície agrícola não utilizada",null,201084,7745,61925,8142,31543,15374,14158,62196]
["Outras superfícies",null,104848,18176,15501,6930,7535,22647,30892,3166]
["SAU (ha)",null,3736140,215675,457881,169779,418977,447853,1924043,101932]
["SAU por Classe de SAU"]
["<5 ha",null,513791,97140,96078,111917,65446,84106,33707,25397]
["5 a 50 ha",null,928258,64978,287293,50293,144511,136405,190137,54642]
["> 50 ha",null,2294091,53557,74510,7569,209020,227342,1700200,21893]
["Composição da SAU"]
["Terras aráveis",null,1725887,106780,152660,99158,152390,204970,975840,34090]
["Horta familiar",null,20965,2627,5473,4479,3585,2750,1265,788]
["Culturas permanentes",null,705232,35529,192795,48292,93058,117592,161657,56309]
["Pastagens permanentes",null,1284056,70739,106953,17850,169945,122542,785282,10746]
["CULTURAS TEMPORÁRIAS(1) (ha)"]
["Total",null,1378415,201585,115365,144367,149942,182744,564221,20190]
["Cereais para grão",null,601003,44914,57288,51856,41645,70617,325832,8852]
["Leguminosas secas para grão",null,25246,5274,1153,6390,1641,1940,8031,817]
["Prados temporários",null,37246,7910,2608,2620,2332,8214,12756,807]
["Culturas forrageiras",null,528049,126449,40588,67414,96213,55044,136253,6087]
["Batata",null,47313,7096,13094,11490,4733,9377,863,660]
["Beterraba sacarina",null,7551,0,0,211,2,4333,2906,100]
["Culturas industriais",null,74400,31,58,377,2793,3727,67301,113]
{"$rows_left_out":40}
{"sheet":"2009","index":5,"n_rows":69,"n_cols":10,"rows_kept":69,"cut":false,"hidden":true,"merged":[[34,0,34,1],[42,0,42,1],[43,0,43,1],[50,0,50,1],[0,0,0,1],[1,0,1,1],[6,0,6,1],[11,0,11,1],[21,0,21,1],[33,0,33,1]]}
[2009,null,"Continente","EDM","TM","BL","BI","LVT","ALE","ALG"]
["EXPLORAÇÕES (nº)",null,278114,49037,61804,49424,33763,39875,31828,12383]
["Explorações por Classe de SAU (nº)"]
["> 0 a <5 ha",null,207062,42732,41227,44966,24855,29979,14706,8597]
["5 a 50 ha",null,59667,5943,19750,4094,7693,8464,10184,3539]
["> 50 ha",null,10047,191,735,101,1179,1095,6535,211]
["SUPERFÍCIE TOTAL DAS EXPLORAÇÕES (ha)",null,4571531,312756,619172,222136,503126,543222,2205930,165189]
["Superfície agrícola utilizada",null,3542305,211154,432873,125436,337031,391006,1956508,88297]
["Matas e florestas sem culturas sob-coberto",null,837431,91139,141138,87108,133621,133716,204104,46605]
["Superfície agrícola não utilizada",null,125283,3543,40223,5822,24674,8331,14593,28096]
["Outras superfícies",null,66512,6920,4937,3770,7800,10169,30724,2191]
["SAU (ha)",null,3542305,211154,432873,125436,337031,391006,1956508,88297]
["SAU por Classe de SAU"]
["<5 ha",null,382341,73356,88640,71587,46245,56041,29656,16815]
["5 a 50 ha",null,777505,62390,239503,44853,105715,109168,170840,45036]
["> 50 ha",null,2382459,75409,104729,8995,185071,225797,1756013,26446]
["Composição da SAU"]
["Terras aráveis",null,1158805,85759,101615,70547,100001,166379,612176,22327]
["Horta familiar",null,18991,3181,5030,4557,2476,1944,1176,628]
["Culturas permanentes",null,686221,26932,191614,33979,74049,93628,221013,45007]
["Pastagens permanentes",null,1678288,95282,134614,16353,160505,129055,1122142,20335]
["Cultura temporárias(1) (ha)"]
["Total",null,923537,139237,66830,85425,92269,139840,391742,8193]
["Cereais para grão",null,345556,28895,29404,34150,16630,57035,177223,2219]
["Leguminosas secas para grão",null,13152,1228,442,1674,659,944,8131,73]
["Prados temporários",null,31652,7352,1129,2055,4087,5595,11377,57]
["Culturas forrageiras",null,442320,96712,30413,41545,68779,37842,162639,4390]
["Batata",null,17331,2059,4927,2923,1321,5592,347,162]
["Beterraba sacarina",null,0,0,0,0,0,0,0,0]
["Culturas industriais",null,24764,22,26,110,383,1098,23119,6]
{"$rows_left_out":40}
{"sheet":"2013","index":6,"n_rows":69,"n_cols":10,"rows_kept":69,"cut":false,"hidden":true,"merged":[[34,0,34,1],[42,0,42,1],[43,0,43,1],[50,0,50,1],[0,0,0,1],[1,0,1,1],[6,0,6,1],[11,0,11,1],[21,0,21,1],[33,0,33,1]]}
[2013,null,"Continente","EDM","TM","BL","BI","LVT","ALE","ALG"]
["EXPLORAÇÕES (nº)",null,240527,41601,57224,38356,30862,31450,29478,11556]
["Explorações por Classe de SAU (nº)"]
["> 0 a <5 ha",null,170929,34958,36763,33787,22572,22192,13094,7563]
["5 a 50 ha",null,58536,6311,19446,4255,6991,7880,9880,3774]
["> 50 ha",null,10249,160,947,127,1290,1133,6386,206]
["SUPERFÍCIE TOTAL DAS EXPLORAÇÕES (ha)",null,4492242,305920,629636,201908,481700,500542,2210340,162196]
["Superfície agrícola utilizada",null,3517740,214554,432056,117387,341976,370390,1949142,92234]
["Matas e florestas sem culturas sob-coberto",null,800482,78380,161286,77716,112576,110706,215120,44698]
["Superfície agrícola não utilizada",null,99394,5144,29164,3215,19009,6334,13407,23122]
["Outras superfícies",null,74626,7842,7130,3591,8139,13113,32670,2141]
["SAU (ha)",null,3517740,214554,432056,117387,341976,370390,1949142,92234]
["SAU por Classe de SAU"]
["<5 ha",null,325926,61143,80763,58033,41743,42278,26893,15073]
["5 a 50 ha",null,797420,69368,258028,49189,98498,105269,167569,49499]
["> 50 ha",null,2394395,84042,93265,10165,201736,222843,1754681,27663]
["Composição da SAU"]
["Terras aráveis",null,1081311,82587,104999,68662,85449,153181,561425,25007]
["Horta familiar",null,14473,2125,4492,2442,1974,1684,1297,460]
["Culturas permanentes",null,704302,26924,196735,28914,75155,94697,235239,46638]
["Pastagens permanentes",null,1717653,102918,125829,17369,179399,120829,1151181,20129]
["Cultura temporárias(1) (ha)"]
["Total",null,840993,130975,65703,81305,70996,129301,350766,11946]
["Cereais para grão",null,305390,21966,31487,28500,12508,54553,154135,2240]
["Leguminosas secas para grão",null,9257,1091,512,1159,245,505,5589,156]
["Prados temporários",null,35532,8171,2442,3117,5029,3836,9283,3655]
["Culturas forrageiras",null,414201,94975,26571,42802,51997,38184,155209,4464]
["Batata",null,11879,1661,3862,1883,639,3612,129,93]
["Beterraba sacarina",null,0,0,0,0,0,0,0,0]
["Culturas industriais",null,19007,196,39,190,4,612,17965,0]
{"$rows_left_out":40}
{"sheet":"Evolução Estrutura","index":7,"n_rows":136,"n_cols":21,"rows_kept":136,"cut":false,"hidden":true,"merged":[[0,1,0,17],[6,1,6,17],[38,1,39,18],[24,20,31,26],[15,20,22,26]]}
[null,"Evolução Estrutural das Explorações Agrícolas do Continente"]
[]
[null,"Escolha variável 1",null,null,null,null,"Escolha variável 2",null,null,null,null,null,"Escolha tipo de evolução"]
[]
[]
[]
[null,{"$f":"+\"Evolução comparativa em \" & Sheet1!I38","v":"Evolução comparativa em Valor Absoluto"}]
[]
[]
[]
[]
[]
[]
[]
[null,null,null,null,null,null,null,null,null,null,null,null,null,null,null,null,null,null,null,null,"Conceito Variável 1"]
[null,null,null,null,null,null,null,null,null,null,null,null,null,null,null,null,null,null,null,null,{"$f":"+Sheet1!C38& \"- \" &INDEX(Sheet1!$P$41:$P$93,Sheet1!$D$38)","v":"Nº de Explorações- Unidade técnico-económica que utiliza fatores de produção comuns, tais como: mão de obra, máquinas, instalações, terrenos, entre outros, e que deve satisfazer obrigatoriamente as quatro condições seguintes: 1. produzir produtos agrícolas ou manter em boas condições agrícolas e ambientais as terras que já não são utilizadas para fins produtivos; 2. atingir ou ultrapassar uma certa dimensão (área, número de animais); 3. estar submetida a uma gestão única; 4. estar localizada num local bem determinado e identificável."}]
[]
[]
[]
[]
[]
[]
[]
[null,null,null,null,null,null,null,null,null,null,null,null,null,null,null,null,null,null,null,null,"Conceito Variável 2"]
[null,null,null,null,null,null,null,null,null,null,null,null,null,null,null,null,null,null,null,null,{"$f":"+Sheet1!G38& \" - \" &INDEX(Sheet1!$P$41:$P$93,Sheet1!$H$38)","v":"SAU de explorações 5 a 50 ha - Superfície da exploração que inclui: terras aráveis (limpa e sob-coberto de matas e florestas), horta familiar, culturas permanentes e pastagens permanentes."}]
[]
[]
[]
[]
[]
{"$rows_left_out":107}
{"sheet":"Sheet1","index":8,"n_rows":93,"n_cols":22,"rows_kept":93,"cut":false,"hidden":true,"merged":[]}
[null,null,null,1,{"$f":"+F1-1","v":1},2,null,1,{"$f":"+J1-1","v":2},3]
[null,null,null,{"$f":"+INDEX($Q$3:$Q$6,D1)","v":"Nº de Explorações"},{"$f":"+INDEX($V$3:$V$10,F1)","v":"Entre Douro e Minho"},null,null,{"$f":"+INDEX($Q$3:$Q$6,H1)","v":"Nº de Explorações"},{"$f":"+INDEX($V$3:$V$10,J1)","v":"Trás-os-Montes"}]
[null,"EXPLORAÇÕES (nº)",null,1989,1993,1995,1997,1999,2003,2005,2007,2009,2013,2016,null,null,"Nº de Explorações",null,null,null,0,"Continente"]
[null,1,0,550879,446146,412064,381793,382163,330656,297046,251547,278114,240527,235774,{"$f":"+B4&C4","v":"10"},null,"Superfície Agrícola Útil (Ha)",null,null,null,1,"Entre Douro e Minho"]
[null,1,1,111505,86967,79916,73048,67546,58757,52696,45848,49037,41601,39651,{"$f":"+B5&C5","v":"11"},null,"Volume de Trabalho (UTA)",null,null,null,2,"Trás-os-Montes"]
[null,1,2,80551,75678,72248,70098,70006,64963,61649,56339,61804,57224,56228,"12",null,"População agrícola (Pessoas)",null,null,null,3,"Beira Litoral"]
[null,1,3,125307,97459,88547,80217,79806,66060,58823,47542,49424,38356,39462,"13",null,null,null,null,null,4,"Beira Interior"]
[null,1,4,60386,49533,45878,42841,48313,40788,35749,30357,33763,30862,29065,"14",null,null,null,null,null,5,"Ribatejo e Oeste"]
[null,1,5,99938,78609,71430,64874,61615,52375,43850,33225,39875,31450,31217,"15",null,null,null,null,null,6,"Alentejo"]
[null,1,6,47049,37491,36114,34722,35906,31830,29558,26032,31828,29478,28424,"16",null,null,null,null,null,7,"Algarve"]
[null,1,7,26143,20409,17931,15993,18971,15883,14721,12204,12383,11556,11728,"17",null,"Valor Absoluto"]
[null,2,0,3879579,3821319,3800379,3700161,3736140,3578034,3552347,3357019,3542305,3517740,3513006,"20",null,"Índice 100 (IND100=1989)"]
[null,2,1,289624,257684,239465,243450,215675,233702,232260,220371,211154,214554,198415,"21"]
[null,2,2,489133,493229,495965,462230,457881,467158,473530,474617,432873,432056,454719,"22"]
[null,2,3,231458,220532,205702,179896,169779,154781,151949,135986,125436,117387,122929,"23"]
[null,2,4,433947,443745,441138,435052,418977,390252,384005,352257,337031,341976,356488,"24"]
[null,2,5,456544,498887,483831,494427,447853,381558,412093,349237,391006,370390,378010,"25"]
[null,2,6,1842094,1766678,1800535,1757360,1924043,1836215,1792285,1721795,1956508,1949142,1906874,"26"]
[null,2,7,136779,140565,133743,127745,101932,114368,106225,102756,88297,92234,95570,"27"]
[null,3,0,810005,576661,551197,492999,497537,431521,376370,319369,341502,304677,295316,"30"]
[null,3,1,218450,153824,150023,127545,122487,103124,88050,74273,78758,68404,58000,"31"]
[null,3,2,99162,81023,81412,73226,81566,77400,67260,65072,69330,68998,71193,"32"]
[null,3,3,188075,127288,121948,105164,107553,88993,79738,59518,65502,48669,46289,"33"]
[null,3,4,85447,52671,47625,46443,49193,44165,42588,33624,33552,30355,26215,"34"]
[null,3,5,126898,93835,89504,83768,75630,63629,50047,42447,47269,40832,38663,"35"]
[null,3,6,61913,48043,43524,42942,44162,40862,35491,32918,35659,35617,41838,"36"]
[null,3,7,30061,19976,17161,13911,16946,13348,13197,11515,11432,11801,13117,"37"]
[null,4,0,1799736,1408613,1261088,1133401,1123418,935316,787102,656296,709928,604926,564670,"40"]
[null,4,1,466783,345726,306268,274338,248443,203845,175226,145511,150588,124339,110068,"41"]
[null,4,2,255688,227653,212261,198007,196960,174969,155729,138630,151529,138731,132411,"42"]
{"$rows_left_out":64}
{"sheet":"Evolução regional","index":9,"n_rows":106,"n_cols":20,"rows_kept":106,"cut":false,"hidden":true,"merged":[[0,1,0,17],[6,1,6,16],[29,1,29,16]]}
[null,"Evolução Estrutural Regional das Explorações Agrícolas"]
[]
[null,"Escolha variável e região 1",null,null,null,null,null,null,"Escolha variável e região 2"]
[]
[]
[]
[null,{"$f":"+\"Evolução comparativa em valor absoluto\"","v":"Evolução comparativa em valor absoluto"}]
[]
[]
[]
[]
[]
[]
[]
[]
[]
[]
[]
[]
[]
[]
[]
[]
[]
[]
[]
[]
[]
[]
[null,{"$f":"+\"Evolução comparativa em Índice (IND100=1989)\"","v":"Evolução comparativa em Índice (IND100=1989)"}]
{"$rows_left_out":76}