{"text_format":"1","workbook":"xlsx","n_sheets":4,"sheets":["INDICE","pesquisa","entraves","aux"],"not_rendered":{"charts":0,"images":2,"macros":1,"external_links":2,"defined_names":40,"comments":0,"pivot_tables":0},"unopened":[],"bounds":{"document_bytes":16777216,"sheet_cells":100000,"rows_first":2000,"rows_last":500,"rows_between":2000,"halvings":0,"cell_chars":16384,"cell_head_chars":4096},"cells_cut":0,"cells_raw":0,"read":"whole","date_system":"1900"}

{"sheet":"INDICE","index":0,"n_rows":21,"n_cols":7,"rows_kept":21,"cut":false,"hidden":false,"merged":[[20,6,22,9],[4,4,6,4]]}
[]
[]
[]
[]
[null,null,null,null,"Constrangimentos à exportação"]
[]
[]
[]
[]
[]
[null,null,null,null,"1. Pesquisa de constrangimentos por estado, país e produto"]
[null,null,null,null,"2. Listagem de todos os constrangimentos"]
[]
[]
[]
[]
[]
[]
[]
[]
[null,null,null,null,null,"Fontes","GPP a partir de dados fornecidos por DGAV, IVV, Casa do Azeite, CE"]

{"sheet":"pesquisa","index":1,"n_rows":9,"n_cols":4,"rows_kept":9,"cut":false,"hidden":false,"merged":[[0,0,0,8],[2,0,2,1]]}
["Pesquisa de constrangimentos à exportação\nincluindo processos de habilitação para a exportação em curso ou resolvidos"]
[]
["Estado",null,"País","Tipo de produto"]
[]
[]
[null,null,null,"Subtipo de produto"]
[]
[]
[null,null,null,"Produto"]

{"sheet":"entraves","index":2,"n_rows":313,"n_cols":13,"rows_kept":313,"cut":false,"hidden":false,"merged":[[1,12,1,18],[0,1,0,3],[0,7,0,8]]}
[null,"Constrangimentos à exportação \nincluindo processos de habilitação para a exportação em curso ou resolvidos (condições de exportação recentemente acordadas)",null,null,null,null,null,"Datas de aprovação/atualização certificado/condições de exportação",null,"Data de atualização da informação deste quadro"]
["Estado","País","Produto","Ponto de situação","Tipo de produto","Subtipo","Condições acordadas","Data de Condições acordadas","Data de Certificado atualizado","Data atualização","Código NC",null,"Fonte: GPP a partir de dados fornecidos por DGAV (set 2014/fev 2016), IVV (mar/nov 2014), Casa do Azeite (set 2014), CE (jan 2016)\n*ACSCC - Animais de Companhia Sem Caráter Comercial"]
["Em curso","África do Sul","Carne de aves","Processo de habilitação para a exportação em curso\nResposta ao questionário enviada às autoridades do país\nAguarda-se resposta","Animal","Carnes"]
["Em curso","África do Sul","Carne de suíno","Carne fresca - Manifestadas intenções exportadoras. Em avaliação prioridade para início do processo \r\nProdutos à base de carne -  Exportados ao abrigo de licença de exportação","Animal","Carnes"]
["Em curso","África do Sul","Maçã","Processo de habilitação para a exportação em curso\nResposta ao questionário enviada às autoridades do país\nRecebido pedido de informação adicional em fase de resposta","Vegetal","Frutas",null,null,null,"2015-02-20"]
["Resolvido","África do Sul","Morango","Acordadas as condições fitossanitárias para a exportação","Vegetal","Frutas",null,"2013-02-01",null,"2015-02-20"]
["Em curso","África do Sul","Peixes ornamentais","Manifestadas intenções exportadoras\nSolicitada informação sobre requisitos de importação às autoridades do país\nAguarda-se resposta","Animal","Animais vivos"]
["Em curso","África do Sul","Pera","Processo de habilitação para a exportação em curso\nResposta ao questionário enviada às autoridades do país\nAguarda-se resposta","Vegetal","Frutas",null,null,null,"2015-02-20"]
["Resolvido","África do Sul","Sémen equino","Acordado certificado e respetivas condições sanitárias para início de exportação","Animal","Outros produtos animais",null,"2013-01-01"]
["Em curso","Albânia","Cães e gatos (ACSCC*) ","Solicitada informação sobre requisitos de entrada às autoridades do país\nAguarda-se resposta","Animal","Animais vivos"]
["Resolvido","Angola","Aves de capoeira e pintos do dia","Acordado certificado e respetivas condições sanitárias para início de exportação","Animal","Animais vivos",null,"2013-03-01"]
["Resolvido","Angola","Cães e gatos (ACSCC*) ","Acordado certificado sanitário oficial sem caráter comercial","Animal","Animais vivos",null,"2013-01-01"]
["Resolvido","Angola","Maionese","Criado novo modelo de certificado para ultrapassar certos constrangimentos","Preparações","Preparações animais",null,"2013-02-01"]
["Em curso","Angola","Ovos","Alguns pedidos de operadores relativos à extensão do prazo de validade em vigor na UE (28 dias)","Animal","Ovos e laticínios"]
["Resolvido","Angola","Ovos para incubação","Acordado certificado e respetivas condições sanitárias para início de exportação","Animal","Ovos e laticínios",null,"2013-02-01"]
["Resolvido","Angola","Sémen bovino","Acordado certificado e respetivas condições sanitárias para início de exportação","Animal","Outros produtos animais",null,"2012-08-01"]
["Em curso","Arábia Saudita","Carnes","Certificado para carne de aves alterado para correção de certos constrangimentos, mas não acordado oficialmente\nEfetuado pedido de extensão da certificação para \"carne de bovino\", \"ovino\" e \"caprino\"\nProposta de certificado enviada às autoridades do país\nAguarda-se resposta","Animal","Carnes"]
["Em curso","Arábia Saudita","Géneros alimentícios processados","Proposta de certificado enviada às autoridades do país\nAguarda-se resposta","Preparações"]
["Em curso","Arábia Saudita","Leite e laticínios","Proposta de certificado enviada às autoridades do país\nAguarda-se resposta","Animal","Ovos e laticínios"]
["Em curso","Arábia Saudita","Maçã","Manifestadas intenções exportadoras\nNecessário solicitar informação sobre requisitos de importação às autoridades do país","Vegetal","Frutas"]
["Em curso","Arábia Saudita","Ovos e ovoprodutos","Proposta de certificado enviada às autoridades do país\nAguarda-se resposta","Animal","Ovos e laticínios"]
["Resolvido","Arábia Saudita","Ovos para Incubação","Acordado certificado e respetivas condições sanitárias para início de exportação","Animal","Ovos e laticínios",null,"2012-12-01"]
["Em curso","Arábia Saudita","Pera","Manifestadas intenções exportadoras\nNecessário solicitar informação sobre requisitos de importação às autoridades do país","Vegetal","Frutas"]
["Em curso","Arábia Saudita","Produtos de origem animal aquática","Proposta de certificado enviada às autoridades do país\nAguarda-se resposta","Animal"]
["Resolvido","Argélia","Bovinos para engorda / abate","Acordado certificado e respetivas condições sanitárias para início de exportação","Animal","Animais vivos",null,"2014-01-01"]
["Resolvido","Argélia","Bovinos reprodutores","Acordado certificado e respetivas condições sanitárias para início de exportação","Animal","Animais vivos",null,"2014-01-01"]
["Resolvido","Argélia","Caracóis vivos para consumo humano","Acordado certificado e respetivas condições sanitárias para início de exportação","Animal","Animais vivos"]
["Resolvido","Argélia","Carne e produtos cárneos de bovino","Acordado certificado e respetivas condições sanitárias para início de exportação","Animal","Carnes",null,"2014-02-01"]
["Resolvido","Argélia","Equídeos","Acordado certificado e respetivas condições sanitárias para início de exportação","Animal",null,null,"2015-01-01"]
["Resolvido","Argélia","Frutas frescas: ameixa, maçã, pera, pêssego e uva de mesa ","Estabelecidos pela Autoridade Fitossanitária do país os seguintes requisitos fitossanitários:\nEnvio tem de ir acompanhado de Certificado Fitossanitário Oficial, indicando, na linha de declarações adicionais: \n\"Les envois ont été soumis à un contrôle officiel attestant de l’absence d’insectes appartenant aux genres Bactrocera, Anastrepha, Rhagoletis, Ceratitis et à l’espéce Quadraspidiotus perniciosus.” e\n\"Les fruits ont été soumis à un traitement thermique de 1º C contre la Ceratitis capitata,pendant 15 jours consécutifs.\"","Vegetal","Frutas",null,"2015-10-21"]
["Resolvido","Argélia","Mel","Acordado certificado para início da exportação de mel pasteurizado\nAceite extensão para mel não pasteurizado","Animal","Outros produtos animais",null,"2013-09-01","2013-12-01"]
["Resolvido","Argentina","Aves ornamentais","Acordado certificado e respetivas condições sanitárias para início de exportação","Animal","Animais vivos",null,"2013-02-01"]
["Resolvido","Argentina","Carne e produtos cárneos de aves","Acordado certificado e respetivas condições sanitárias para início de exportação","Animal","Carnes",null,"2013-12-01"]
["Resolvido","Argentina","Cavalos","Acordado certificado e respetivas condições sanitárias para início de exportação","Animal","Animais vivos",null,"2013-01-01"]
["Resolvido","Argentina","Penas e plumas","Acordado certificado e respetivas condições sanitárias para início de exportação","Animal","Outros produtos animais",null,"2013-07-01"]
["Em curso","Argentina","Pescado","Prazo de habilitação de estabelecimentos pré-listados para a exportação caducado\nNecessário renová-lo","Animal","Pescado"]
["Resolvido","Argentina","Produtos cárneos (suíno)","Acordado certificado e respetivas condições sanitárias para início de exportação","Animal","Carnes",null,"2013-12-01"]
["Em curso","Argentina","Laticínios","Prazo de habilitação de estabelecimentos pré-listados para a exportação caducado\nNecessário renová-lo","Animal","Ovos e laticínios"]
["Em curso","Arménia","Carnes transformadas","Manifestadas intenções exportadoras \nEm avaliação prioridade para início do processo","Animal","Carnes"]
["Em curso","Arménia","Subprodutos de origem animal destinados a alimentos para animais","Proposta de certificado enviada às autoridades do país\nAguarda-se resposta","Animal","Outros produtos animais"]
["Em curso","Austrália","Produtos de origem animal","Manifestadas intenções exportadoras \nEm avaliação prioridade para início do processo","Animal"]
["Em curso","Bahamas","Cães e gatos (ACSCC*) ","Solicitada informação sobre requisitos de entrada às autoridades do país\nAguarda-se resposta","Animal","Animais vivos"]
["Em curso","Bahrain","Carne e produtos cárneos","Proposta de certificado enviada às autoridades do país\nAguarda-se resposta","Animal","Carnes"]
["Em curso","Bahrain","Géneros alimentícios processados","Proposta de certificado enviada às autoridades do país\nAguarda-se resposta","Preparações"]
["Em curso","Bahrain","Ovos e ovoprodutos","Proposta de certificado enviada às autoridades do país\nAguarda-se resposta","Animal","Ovos e laticínios"]
["Em curso","Bahrain","Produtos da pesca","Proposta de certificado enviada às autoridades do país\nAguarda-se resposta","Animal","Pescado"]
["Em curso","Bahrain","Laticínios","Proposta de certificado enviada às autoridades do país\nAguarda-se resposta","Animal","Ovos e laticínios"]
["Em curso","Benim","Carne de aves","Manifestadas intenções exportadoras\nExportações efetuadas a coberto de certificado generalista","Animal","Carnes"]
["Em curso","Bolívia","Vinho","Para além dos Certificados das CVR, exigência de Certificado Livre Venda global emitido pelo IVV","Bebidas","Produtos vínicos"]
["Resolvido","Bósnia e Herzegovina","Produtos da pesca e da aquicultura","Acordado certificado e respetivas condições sanitárias para início de exportação","Animal","Pescado",null,"2013-07-01"]
["Em curso","Brasil","Bovinos (incluindo animais vivos para criação)","Processo de habilitação para a exportação em curso\nCertificado em discussão entre as autoridades\nEm standby, já que deverá envolver a realização de missão de inspeção","Animal","Animais vivos",null,null,null,"2016-03-31"]
["Resolvido","Brasil","Cães e gatos (ACSCC*) ","Acordado certificado sanitário oficial sem caráter comercial","Animal","Animais vivos",null,"2013-02-01"]
["Em curso","Brasil","Carne de aves","Processo de habilitação para a exportação em curso\nEm standby, já que deverá envolver a realização de missão de inspeção","Animal",null,null,null,null,"2016-03-31"]
["Em curso","Brasil","Carne de caracol","Manifestadas intenções exportadoras \nEm avaliação prioridade para início do processo (como produto de pescado)","Animal","Carnes"]
["Resolvido","Brasil","Carne e produtos cárneos de suíno","Acordado certificado e respetivas condições sanitárias para início de exportação.\nEm atualização no site do MAPA as Listas de Estabelecimentos Portugueses Habilitados à Exportação para o Brasil, informação já enviada para o Brasil.","Animal","Carnes",null,null,null,"2016-03-31"]
["Em curso","Brasil","Carne e produtos cárneos de coelho","Manifestadas intenções exportadoras\nAutoridades do país informam que é necessário proceder à habilitação do setor \nEm standby, já que envolve a realização de missão de inspeção","Animal","Carnes",null,null,null,"2016-03-31"]
["Resolvido","Brasil","Cavalos","Acordado certificado e respetivas condições sanitárias para início de exportação","Animal","Animais vivos",null,"2013-03-01"]
["Em curso","Brasil","Citrinos","Processo de habilitação para exportação em curso \nResposta a questionário enviada às autoridades do país \nBrasil procedeu a uma 1ª Análise de Risco para o caso do Limão e solicitou informação complementar.\nInformação complementar enviada às autoridades do país\nAguarda-se o estabelecimento dos requisitos fitossanitários para o caso do Limão e resposta para os restantes Citrinos","Vegetal","Frutas",null,null,null,"2016-03-28"]
["Em curso","Brasil","Dióspiro","Manifestadas intenções exportadoras \nEm avaliação prioridade para início do processo","Vegetal","Frutas"]
["Resolvido","Brasil","Embriões de bovino","Acordado certificado e respetivas condições sanitárias para início de exportação","Animal","Outros produtos animais",null,"2013-02-01",null,"2016-03-31"]
["Em curso","Brasil","Figo seco","Manifestadas intenções exportadoras \nEm avaliação prioridade para início do processo","Vegetal","Frutas"]
["Resolvido","Brasil","Kiwi","Acordadas as condições fitossanitárias para a exportação (ver Instrução Normativa nº 19)","Vegetal","Frutas","Instrução Normativa nº19","2011-06-13"]
["Resolvido","Brasil","Laticínios","Acordado certificado e respetivas condições sanitárias para início de exportação\nEm atualização no site do MAPA as Listas de Estabelecimentos Portugueses Habilitados à Exportação para o Brasil, informação já enviada para o Brasil.","Animal","Ovos e laticínios",null,"2012-12-01",null,"2016-03-31"]
["Em curso","Brasil","Mel e produtos apícolas","Processo de habilitação para a exportação em curso\nEstá ultimada a fase da proposta de certificado mas é ainda necessário proceder à habilitação do setor\nEm standby, já que envolve a realização de missão de inspeção","Animal","Outros produtos animais",null,null,null,"2016-03-31"]
["Em curso","Brasil","Nectarinas","Processo para habilitação para exportação em curso \nResposta a questionário enviada às autoridades do país \nAguarda-se resposta","Vegetal","Frutas"]
["Em curso","Brasil","Ovos e ovoprodutos","Manifestadas intenções exportadoras\nAutoridades do país informam que é necessário proceder à habilitação do setor\nEm standby, já que envolve a realização de missão de inspeção","Animal","Ovos e laticínios",null,null,null,"2016-03-31"]
["Resolvido","Brasil","Peixes ornamentais","Acordado certificado e respetivas condições sanitárias para início de exportação","Animal","Animais vivos",null,"2013-01-01"]
["Resolvido","Brasil","Produtos da pesca","Acordado certificado e respetivas condições sanitárias para início de exportação\nEm atualização no site do MAPA as Listas de Estabelecimentos Portugueses Habilitados à Exportação para o Brasil, informação já enviada para o Brasil.","Animal","Pescado",null,"2012-07-01","2014-01-01","2016-03-31"]
["Em curso","Brasil","Queijo da Serra da Estrela (DOP)","Utilização comercial indevida desta Designação de Origem Protegida","Animal","Ovos e laticínios"]
["Resolvido","Brasil","Répteis","Acordado certificado e respetivas condições sanitárias para início de exportação","Animal","Animais vivos",null,"2011-12-01"]
["Resolvido","Brasil","Roedores","Acordado certificado e respetivas condições sanitárias para início de exportação","Animal","Animais vivos",null,"2011-12-01"]
["Resolvido","Brasil","Sémen bovino","Acordado certificado e respetivas condições sanitárias para início de exportação","Animal","Outros produtos animais",null,"2012-08-01",null,"2016-03-31"]
["Resolvido","Brasil","Sémen canino","Acordado certificado e respetivas condições sanitárias para início de exportação","Animal","Outros produtos animais",null,"2012-04-01"]
["Resolvido","Brasil","Sémen suíno","Acordado certificado e respetivas condições sanitárias para início de exportação.","Animal","Outros produtos animais",null,"2014-03-19",null,"2016-03-31"]
["Resolvido","Brasil","Uva de mesa","Acordados requisitos fitossanitários para a exportação  (ver Instrução Normativa nº 25)","Vegetal","Frutas","Instrução Normativa nº25","2015-10-13",null,"2015-10-16"]
["Em curso","Brasil","Vinho","Exigências em matéria de rotulagem e de certas regras específicas\nDificuldade no envio de amostras","Bebidas","Produtos vínicos"]
["Resolvido","Cabo Verde","Aves de capoeira e pintos do dia","Acordado certificado e respetivas condições sanitárias para início de exportação","Animal","Animais vivos",null,"2011-12-01","2013-02-01"]
["Resolvido","Cabo Verde","Coelhos vivos","Acordado certificado sanitário oficial sem caráter comercial","Animal","Animais vivos",null,"2014-07-14"]
["Resolvido","Cabo Verde","Peixes ornamentais","Acordado certificado e respetivas condições sanitárias para início de exportação","Animal","Animais vivos",null,"2012-12-01"]
["Em curso","Cabo Verde","Pombos correio","Manifestadas intenções exportadoras\nSolicitada informação sobre requisitos de importação às autoridades do país\nAguarda-se resposta","Animal","Animais vivos"]
["Resolvido","Cabo Verde","Suínos vivos","Acordado certificado e respetivas condições sanitárias para início de exportação","Animal","Animais vivos",null,"2011-12-01"]
["Resolvido","Camarões","Laticínios","Acordado certificado e respetivas condições sanitárias para início de exportação","Animal","Ovos e laticínios",null,"2012-12-01"]
["Em curso","Canadá","Ameixa","Manifestadas intenções exportadoras\nSolicitada informação sobre requisitos de importação às autoridades do país\nAguarda-se resposta","Vegetal","Frutas"]
["Resolvido","Canadá","Carne e produtos cárneos ","Acordado certificado e respetivas condições sanitárias para início de exportação \n(para a carne de bovino, as autoridades canadianas reabriram o seu mercado à importação da UE em outubro de 2015)","Animal","Carnes",null,"2014-05-01"]
["Resolvido","Canadá","Cavalos","Acordado certificado e respetivas condições sanitárias para início de exportação","Animal","Animais vivos",null,"2011-12-01"]
["Resolvido","Catar","Aves que não de capoeira","Acordado certificado e respetivas condições sanitárias para início de exportação","Animal","Animais vivos",null,"2013-01-01"]
["Em curso","Catar","Bovinos","Proposta de certificado enviada às autoridades do país\nAguarda-se resposta","Animal","Animais vivos"]
["Resolvido","Catar","Cães e gatos (ACSCC*)","Acordado certificado sanitário oficial sem caráter comercial","Animal","Animais vivos",null,"2013-01-01"]
["Em curso","Catar","Carne e produtos cárneos","Proposta de certificado enviada às autoridades do país\nAguarda-se resposta","Animal","Carnes"]
["Em curso","Catar","Géneros alimentícios processados","Proposta de certificado enviada às autoridades do país\nAguarda-se resposta","Preparações"]
["Em curso","Catar","Ovos e ovoprodutos","Proposta de certificado enviada às autoridades do país\nAguarda-se resposta","Animal","Ovos e laticínios"]
["Em curso","Catar","Produtos da pesca e da aquicultura","Proposta de certificado enviada às autoridades do país\nAguarda-se resposta","Animal","Pescado"]
["Em curso","Catar","Laticínios","Proposta de certificado enviada às autoridades do país\nAguarda-se resposta","Animal","Ovos e laticínios"]
["Em curso","Chile","Maçã","Processo de habilitação para a exportação em curso\nAutoridades do país exigem Análise de Risco de Pragas (ARP) e enviam questionário\nResposta a questionário enviada às autoridades do país.\nEnviados (pela UE/Comissão) para o Chile os comentários à ultima proposta chilena de mitigação de risco fitossanitário, recebida em novembro de 2015.\nAguarda-se resposta","Vegetal","Frutas",null,null,null,"2016-04-05"]
["Em curso","Chile","Pera","Processo de habilitação para a exportação em curso\nAutoridades do país exigem Análise de Risco de Pragas (ARP) e enviam questionário\nResposta a questionário enviada às autoridades do país.\nEnviados (pela UE/Comissão) para o Chile os comentários à ultima proposta chilena de mitigação de risco fitossanitário, recebida em novembro de 2015.\nAguarda-se resposta","Vegetal","Frutas",null,null,null,"2016-04-05"]
["Em curso","Chile","Produtos de origem animal (carnes, pescado)","No âmbito das medidas facilitadoras de comércio entre a UE e o Chile, ao abrigo do respetivo Acordo de Associação, a DGAV está a ultimar a listagem de operadores interessados, para envio à Comissão Europeia, que a remeterá ao Chile para validação","Animal"]
["Resolvido","Chile","Laticínios","Acordado certificado e respetivas condições sanitárias para início de exportação\nEm curso registo de operadores","Animal","Ovos e laticínios",null,"2014-09-01"]
["Em curso","Chile","Proteinas animais de aves, transformadas","Enviada proposta de acordo escrito para exportação (ao abrigo do Reg (CE) nº 999/2001)\nAguarda-se resposta","Animal","Outros produtos animais"]
["Resolvido","China","Animais aquáticos vivos para consumo humano","Acordado certificado e respetivas condições sanitárias para início de exportação\nEm atualização","Animal","Animais vivos",null,"2013-12-01"]
["Em curso","China","Arroz (baby rice)","Processo de habilitação para a exportação em curso\nResposta ao questionário enviada às autoridades do país\nAguarda-se resposta","Vegetal","Outros produtos vegetais",null,null,null,"2016-02-18"]
["Em curso","China","Carne de aves","Manifestadas intenções exportadoras\nSolicitada informação sobre requisitos de importação às autoridades do país\nResposta refere grande número de pedidos em espera\nEfetuada insistência numa resposta. AQSIQ informa que só deve ser iniciado este processo após conclusão do da carne de porco.","Animal","Carnes",null,null,null,"2016-07-20"]
["Em curso","China","Carne de suíno","Processo de habilitação para a exportação em curso\nMissão de peritos chineses a Portugal já realizada\nRelatório da missão já recebido. Autoridades nacionais enviaram resposta.\nEfetuada insistência sobre o resultado da avaliação de risco. Foi elaborada resposta a  informações adicionais solicitadas pela AQSIQ.","Animal","Carnes",null,null,null,"2016-07-20"]
["Em curso","China","Cavalos","Processo de habilitação para a exportação em curso\nResposta ao questionário enviada às autoridades do país. Efetuado convite para realização de missão. Aguarda-se agendamento da mesma.","Animal","Animais vivos",null,null,null,"2016-02-17"]
["Em curso","China","Citrinos","Processo de habilitação para a exportação em curso\nResposta ao questionário enviada às autoridades do país\nAguarda-se resposta","Vegetal","Frutas",null,null,null,"2016-02-18"]
["Em curso","China","Dióspiro","Manifestadas intenções exportadoras \nEm avaliação prioridade dar continuidade ao processo","Vegetal","Frutas"]
["Em curso","China","Kiwi","Processo de habilitação para a exportação em curso\nAutoridades do país exigem Análise de Risco e enviam questionário\nEm avaliação prioridade para dar continuidade ao processo.","Vegetal","Frutas",null,null,null,"2016-02-18"]
["Resolvido","China","Leite e laticínios (exceto fórmulas infantis) ","Acordado certificado e respetivas condições sanitárias para início de exportação","Animal","Ovos e laticínios",null,"2013-12-01",null,"2015-03-11"]
["Em curso","China","Maçã","Processo de habilitação para a exportação em curso\nAutoridades do país exigem Análise de Risco e enviam questionário\nResposta a questionário enviada às autoridades do país\nAguarda-se resposta","Vegetal","Frutas",null,null,null,"2016-02-18"]
["Em curso","China","Peixes ornamentais","Proposta de certificado enviada às autoridades do país\nAutorizado apenas para remessa específica","Animal","Animais vivos",null,null,null,"2015-03-11"]
["Em curso","China","Pera","Processo de habilitação para a exportação em curso\nAutoridades do país exigem Análise de Risco e enviam questionário\nResposta a questionário enviada às autoridades do país\nAguarda-se resposta","Vegetal","Frutas",null,null,null,"2016-02-18"]
["Em curso","China","Porquinhos da Índia (ACSCC*)","Solicitada informação sobre requisitos de entrada às autoridades do país\nAguarda-se resposta","Animal","Animais vivos",null,null,null,"2015-03-11"]
["Resolvido","China","Produtos da pesca e da aquicultura","Acordado certificado e respetivas condições sanitárias para início de exportação\nEm atualização","Animal","Pescado",null,"2012-06-01"]
["Resolvido","China","Laticínios (fórmulas infantis - \"papas\")","Exportação autorizada. Acordado certificado e respetivas condições sanitárias.","Animal","Ovos e laticínios",null,"2015-05-01",null,"2015-05-20"]
["Resolvido","China","Roedores","Acordado certificado e respetivas condições sanitárias para início de exportação","Animal","Animais vivos",null,"2013-12-01"]
["Em curso","China","Uva de mesa","Processo de habilitação para a exportação em curso\nAutoridades do país exigem Análise de Risco e enviam questionário\nResposta a questionário enviada às autoridades do país\nAguarda-se resposta","Vegetal","Frutas",null,null,null,"2016-02-18"]
["Em curso","Colômbia","Ameixa","Manifestadas intenções exportadoras\nSolicitada informação sobre requisitos de importação às autoridades do país\nAutoridades do país reconhecem sistema de controlo da UE, abrindo caminho para facilitação de procedimentos de exportação para Estados-Membros com processos de habilitação em curso (PT, ES, FR)","Vegetal","Frutas",null,null,null,"2015-02-20"]
["Resolvido","Colômbia","Cães e gatos (ACSCC*) ","Acordado certificado sanitário oficial sem caráter comercial","Animal","Animais vivos",null,"2014-05-12"]
["Resolvido","Colômbia","Carne de suíno","Exportação autorizada apenas para a carne congelada. Acordado certificado sanitário e respetivas condições sanitárias.","Animal",null,null,null,null,"2016-07-20"]
["Em curso","Colômbia","Cereja","Processo de habilitação para a exportação em curso\nResposta a questionário enviada às autoridades do país\nAutoridades do país reconhecem sistema de controlo da UE, abrindo caminho para facilitação de procedimentos de exportação para Estados-Membros com processos de habilitação em curso (PT, ES, FR)","Vegetal","Frutas",null,null,null,"2015-02-20"]
["Em curso","Colômbia","Citrinos","Processo de habilitação para a exportação em curso\nResposta a questionário enviada às autoridades do país\nAutoridades do país reconhecem sistema de controlo da UE, abrindo caminho para facilitação de procedimentos de exportação para Estados-Membros com processos de habilitação em curso (PT, ES, FR)","Vegetal","Frutas",null,null,null,"2015-02-20"]
["Em curso","Colômbia","Kiwi","Manifestadas intenções exportadoras\nSolicitada informação sobre requisitos de importação às autoridades do país\nAutoridades do país reconhecem sistema de controlo da UE, abrindo caminho para facilitação de procedimentos de exportação para Estados-Membros com processos de habilitação em curso (PT, ES, FR)","Vegetal","Frutas",null,null,null,"2015-02-20"]
["Resolvido","Colômbia","Maçã","Acordadas as condições fitossanitárias para a exportação","Vegetal","Frutas",null,"2014-03-26",null,"2015-02-20"]
["Resolvido","Colômbia","Pera","Acordadas as condições fitossanitárias para a exportação","Vegetal","Frutas","Lista de operadores registados candidatos à exportação ","2016-02-01",null,"2015-08-12"]
["Em curso","Colômbia","Pêssego e nectarina","Processo de habilitação para a exportação em curso\nResposta a questionário enviada às autoridades do país\nAutoridades do país reconhecem sistema de controlo da UE, abrindo caminho para facilitação de procedimentos de exportação para Estados-Membros com processos de habilitação em curso (PT, ES, FR)","Vegetal","Frutas",null,null,null,"2015-02-20"]
["Em curso","Colômbia","Produtos cárneos (aves e suínos)","Solicitada informação sobre requisitos de importação às autoridades do país\nAutoridades do país reconhecem sistema de controlo da UE, abrindo caminho para facilitação de procedimentos de exportação para  Estados-Membros com processos de habilitação em curso (PT, ES, FR)\nEm finais de Maio de 2015 foi acordado um procedimento único ICA/INVIMA de habilitação para exportação. Carne suíno: Exportação autorizada para carne congelada. Acordado certificado sanitário e respetivas condições sanitárias. Produtos à base de carne de suino: em curso. Carne de aves: processo de habilitação em curso.","Animal","Carnes",null,null,null,null,null,null,"http://www.agroinfo.pt/novos-mercados-abertos-pela-ue-depois-do-embargo-russo/"]
["Resolvido","Colômbia","Produtos lácteos","Acordado certificado e respetivas condições sanitárias para início de exportação","Animal"]
["Resolvido","Colômbia","Sémen equino","Acordado certificado e respetivas condições sanitárias para início de exportação","Animal","Outros produtos animais",null,"2014-04-01"]
["Em curso","Colômbia","Uva de mesa","Processo de habilitação para a exportação em curso.\nResposta a questionário enviada às autoridades do país.\nAutoridades do país reconhecem sistema de controlo da UE, abrindo caminho para facilitação de procedimentos de exportação para Estados-Membros com processos de habilitação em curso (PT, ES, FR)","Vegetal","Frutas"]
["Em curso","Colômbia","Vinho","Dificuldade no envio de amostras; não se podem enviar amostras fora do período das feiras\nPara além dos Certificados das CVR, exigência de Certificado Livre Venda global emitido pelo IVV","Bebidas","Produtos vínicos"]
["Resolvido","Coreia do Sul","Cães e gatos (ACSCC*) ","Acordado certificado sanitário oficial sem caráter comercial","Animal","Animais vivos",null,"2014-05-20"]
["Em curso","Coreia do Sul","Carne e produtos cárneos de suíno","Processo de habilitação para a exportação em curso\nNecessária habilitação de estabelecimentos. Missão de inspeção das autoridades do país a Portugal\nAguarda-se resposta com resultado da missão","Animal","Carnes"]
["Em curso","Coreia do Sul","Ovos para incubação (galinha e pata)","Manifestadas intenções exportadoras\nSolicitada informação sobre requisitos de importação às autoridades do país\nAguarda-se resposta","Animal","Ovos e laticínios"]
["Resolvido","Costa do Marfim","Pintos do dia","Acordado certificado e respetivas condições sanitárias para início de exportação","Animal","Animais vivos",null,"2014-04-10"]
["Resolvido","Costa do Marfim","Laticínios","Acordado certificado e respetivas condições sanitárias para início de exportação","Animal","Ovos e laticínios",null,"2012-12-01"]
["Resolvido","Costa Rica","Aves ornamentais (ACSCC*) ","Acordado certificado sanitário oficial sem caráter comercial","Animal","Animais vivos",null,"2013-01-01"]
["Resolvido","Costa Rica","Cães e gatos (ACSCC*) ","Acordado certificado sanitário oficial sem caráter comercial","Animal","Animais vivos",null,"2013-01-01"]
["Em curso","Costa Rica","Citrinos","Processo de habilitação para a exportação em curso\nQuestionário recebido das autoridades do país\nResposta a questionário enviada às autoridades do país.\nAguarda-se resposta.","Vegetal","Frutas",null,null,null,"2015-02-20"]
["Em curso","Costa Rica","Kiwi","Processo de habilitação para a exportação em curso\nQuestionário recebido das autoridades do país em fase de resposta","Vegetal","Frutas",null,null,null,"2015-02-20"]
["Resolvido","Costa Rica","Maçã","Acordados os seguintes requisitos fitossanitários: envio deve ir acompanhado de  Certificado Fitossanitário Oficial, indicando na linha de declarações adicionais que está livre de Ceroplastes rusci, Cydia pomonella, Diaspidiotus perniciosus, Grapholita molesta e Pseudococcus calceolariae\nRequisitos gerais para produtos de consumo em fresco: devem ir devidamente embalados e identificados e livres de resíduos vegetais, terra, caracóis e lesmas","Vegetal","Frutas",null,"2015-10-01",null,"2015-10-16"," Malus domestica "]
["Em curso","Costa Rica","Pera","Processo de habilitação para a exportação em curso\nConcluída Análise de Risco e definidos respetivos requisitos fitossanitários pelas autoridades do país que foram aceites pelas autoridades nacionais \nAguarda-se para breve período obrigatório de consulta à OMC a efetuar pelas autoridades do país","Vegetal","Frutas",null,null,null,"2015-10-16","Pyrus communis"]
["Em curso","Costa Rica","Uva de mesa","Processo de habilitação para a exportação em curso\nResposta a questionário enviada às autoridades do país\nAguarda-se resposta","Vegetal","Frutas",null,null,null,"2015-02-20"]
["Em curso","Cuba","Carne e produtos cárneos de aves","Proposta de certificado enviada às autoridades do país\nAguarda-se resposta","Animal","Carnes"]
["Em curso","Cuba","Carne e produtos cárneos de suíno","Proposta de certificado enviada às autoridades do país\nAguarda-se resposta","Animal","Carnes"]
["Resolvido","Egito","Aves de capoeira e pintos do dia","Acordado certificado e respetivas condições sanitárias para início de exportação (para galinhas e patos)","Animal","Animais vivos",null,"2011-12-01"]
["Resolvido","Egito","Cães e gatos (ACSCC*) ","Acordado certificado sanitário oficial sem caráter comercial","Animal","Animais vivos",null,"2013-01-01"]
["Em curso","Emirados Árabes Unidos","Aves de capoeira","Proposta de certificado enviada às autoridades do país\nAguarda-se resposta","Animal","Animais vivos"]
["Em curso","Emirados Árabes Unidos","Aves que não de capoeira","Proposta de certificado enviada às autoridades do país\nAguarda-se resposta","Animal","Animais vivos"]
["Resolvido","Emirados Árabes Unidos","Cães e gatos (ACSCC*) ","Acordado certificado sanitário oficial sem caráter comercial","Animal","Animais vivos",null,"2013-02-01"]
["Resolvido","Emirados Árabes Unidos","Canários","Acordado certificado e respetivas condições sanitárias para início de exportação","Animal","Animais vivos",null,"2013-01-01"]
["Resolvido","Emirados Árabes Unidos","Carne e produtos cárneos de aves","Acordado certificado e respetivas condições sanitárias para início de exportação","Animal","Carnes",null,"2013-12-01"]
["Resolvido","Emirados Árabes Unidos","Carne e produtos cárneos de ovinos e caprinos","Acordado certificado e respetivas condições sanitárias para início de exportação","Animal","Carnes",null,"2013-12-01"]
["Em curso","Emirados Árabes Unidos","Carnes frescas de leporídeos","Proposta de certificado enviada às autoridades do país\nAguarda-se resposta","Animal","Carnes"]
["Resolvido","Emirados Árabes Unidos","Falcões","Acordado certificado e respetivas condições sanitárias para início de exportação","Animal","Animais vivos",null,"2013-01-01"]
["Em curso","Emirados Árabes Unidos","Géneros alimentícios processados","Proposta de certificado enviada às autoridades do país\nAguarda-se resposta","Preparações"]
["Em curso","Emirados Árabes Unidos","Ovos e ovoprodutos","Proposta de certificado enviada às autoridades do país\nAguarda-se resposta","Animal","Ovos e laticínios"]
["Resolvido","Emirados Árabes Unidos","Peixes vivos","Acordado certificado e respetivas condições sanitárias para início de exportação","Animal","Animais vivos",null,"2014-07-01"]
["Em curso","Emirados Árabes Unidos","Produtos da pesca","Proposta de certificado enviada às autoridades do país\nAguarda-se resposta","Animal","Pescado"]
["Em curso","Emirados Árabes Unidos","Laticínios","Proposta de certificado enviada às autoridades do país\nAguarda-se resposta","Animal","Ovos e laticínios"]
["Resolvido","Equador","Cavalos","Acordado certificado e respetivas condições sanitárias para início de exportação","Animal","Animais vivos",null,"2013-02-01"]
["Em curso","Equador","Maçã","Manifestadas intenções exportadoras\nSolicitada informação sobre requisitos de importação às autoridades do país\nAguarda-se resposta","Vegetal","Frutas",null,null,null,"2015-02-20"]
["Em curso","Equador","Pera","Manifestadas intenções exportadoras\nSolicitada informação sobre requisitos de importação às autoridades do país\nAguarda-se resposta","Vegetal","Frutas",null,null,null,"2015-02-20"]
["Resolvido","Estados Unidos da América","Aves ornamentais","Acordado certificado e respetivas condições sanitárias para início de exportação","Animal","Animais vivos",null,"2014-07-01"]
["Resolvido","Estados Unidos da América","Cavalos","Acordado certificado e respetivas condições sanitárias para início de exportação","Animal","Animais vivos",null,"2013-02-01"]
["Em curso","Estados Unidos da América","Maçã","Processo de habilitação para a exportação em curso\nPortugal integrou candidatura conjunta da UE para aprovação de requisitos alternativos ao procedimento \"Preclearance\" para exportação de peras e maçãs (BE, ES, FR, IT, NL, PT formalizada em 11-2010)\nEUA  publicaram lista de pragas em setembro 2014. Aguarda-se estabelecimento de requisitos de importação.\nEm paralelo, iniciada negociação DGAV/USDA para procedimento \"Preclearence\"\nO período (alargado) de consulta pública concedido pela APHIS (The Animal and Plant Health Inspection Service) à proposta de alteração dos regulamentos para permitir a importação de maçã dos países atrás referidos, terminou. Aguarda-se o feedback da análise por parte da APHIS","Vegetal","Frutas",null,null,null,"2016-08-18"]
["Em curso","Estados Unidos da América","Pera","Processo de habilitação para a exportação em curso\nPortugal integrou candidatura conjunta da UE para aprovação de requisitos alternativos ao procedimento \"Preclearance\" para exportação de peras e maçãs (BE, ES, FR, IT, NL, PT formalizada em 11-2010)\nEUA vão publicar lista de pragas. Após publicação da lista, é ainda necessário estabelecer requisitos de importação.\nEm paralelo, iniciada negociação DGAV/USDA para procedimento \"Preclearence\"\nO período (alargado) de consulta pública concedido pela APHIS (The Animal and Plant Health Inspection Service) à proposta de alteração dos regulamentos para permitir a importação de pera dos países atrás referidos, terminou. Aguarda-se o feedback da análise por parte da APHIS","Vegetal","Frutas",null,null,null,"2016-08-18"]
["Em curso","Estados Unidos da América","Produtos cárneos","Manifestadas intenções exportadoras\nAutoridades norte-americanas exigem resposta a questionário altamente exigente com prazo para conclusão muito curto\nFoi aberto o processo mas caducou sem estar concluído\nNecessário reiniciar processo","Animal","Carnes"]
["Resolvido","Filipinas","Cães e gatos (ACSCC*) ","Acordado certificado sanitário oficial sem caráter comercial","Animal","Animais vivos",null,"2013-01-01"]
["Em curso","Filipinas","Produtos cárneos","Processo de habilitação para a exportação em curso\nQuestionário enviado pelas autoridades do país em fase de resposta","Animal","Carnes"]
["Em curso","Filipinas","Subprodutos de origem animal destinados a alimentos para animais","Processo de habilitação para a exportação em curso\nEnviada resposta ao questionário às autoridades do país\nAguarda-se resposta","Animal","Outros produtos animais"]
["Em curso","Gabão","Carne de aves","Manifestadas intenções exportadoras \nEm avaliação prioridade para início do processo","Animal","Carnes"]
["Em curso","Geórgia","Cães e gatos (ACSCC*) ","Acordado certificado sanitário oficial sem caráter comercial (jan 2013)","Animal","Animais vivos",null,"2013-01-01"]
["Em curso","Geórgia","Produtos cárneos","Manifestadas intenções exportadoras \nEm avaliação prioridade para início do processo","Animal","Carnes"]
["Em curso","Guatemala","Laticínios","Manifestadas intenções exportadoras \nEm avaliação prioridade para início do processo","Animal","Ovos e laticínios"]
["Resolvido","Guiné Equatorial","Cães e gatos (ACSCC*) ","Acordado certificado sanitário oficial sem caráter comercial","Animal","Animais vivos",null,"2014-01-01"]
["Em curso","Índia","Ameixa","Manifestadas intenções exportadoras\nNecessário recolher informação exigida e enviá-la para dar início a processo de habilitação (análise de risco)","Vegetal","Frutas"]
["Em curso","Índia","Carne de aves","Proposta de certificado enviada às autoridades do país\nAguarda-se resposta","Animal","Carnes"]
["Em curso","Índia","Carne de suíno","Proposta de certificado enviada às autoridades do país\nAguarda-se resposta","Animal","Carnes"]
["Em curso","Índia","Maçã","Processo de habilitação para a exportação em curso\nQuestionário recebido das autoridades do país\nResposta ao questionário enviada às autoridades do país\nAguarda-se resposta","Vegetal","Frutas",null,null,null,"2015-02-20"]
["Em curso","Índia","Pera","Processo de habilitação para a exportação em curso\nQuestionário recebido das autoridades do país\nResposta ao questionário enviada às autoridades do país\nAguarda-se resposta","Vegetal","Frutas",null,null,null,"2015-02-20"]
["Em curso","Índia","Laticínios","Proposta de certificado enviada às autoridades do país\nAguarda-se resposta","Animal","Ovos e laticínios"]
["Em curso","Índia","Subprodutos de origem animal destinados a alimentos para animais (carne e ossos)","Proposta de certificado enviada às autoridades do país\nAguarda-se resposta","Animal","Outros produtos animais"]
["Em curso","Indonésia","Aves que não de capoeira","Manifestadas intenções exportadoras\nSolicitada informação sobre requisitos de importação às autoridades do país\nAguarda-se resposta","Animal","Animais vivos"]
["Resolvido","Indonésia","Cães e gatos (ACSCC*) ","Acordado certificado sanitário oficial sem caráter comercial","Animal","Animais vivos",null,"2007-12-01","2014-02-01"]
["Em curso","Indonésia","Conservas de pescado","Proposta de certificado enviada às autoridades do país\nAguarda-se resposta","Animal","Pescado",null,null,null,"2015-05-28"]
["Em curso","Indonésia","Maçã","Processo de habilitação para a exportação em curso\nAutoridades do país exigem Análise de Risco e enviam questionário\nResposta a questionário enviada às autoridades do país.\nAguarda-se resposta","Vegetal","Frutas",null,null,null,"2015-05-28"]
["Em curso","Indonésia","Pera","Processo de habilitação para a exportação em curso\nAutoridades do país exigem Análise de Risco e enviam questionário\nResposta a questionário enviada às autoridades do país.\nAguarda-se resposta","Vegetal","Frutas",null,null,null,"2015-05-28"]
["Em curso","Irão","Carne e produtos cárneos de ruminantes","Manifestadas intenções exportadoras\nProposta de certificado em fase de elaboração","Animal","Carnes"]
["Em curso","Iraque","Conservas de pescado","Proposta de certificado enviada às autoridades do país\nAguarda-se resposta","Animal","Pescado"]
["Em curso","Iraque","Ovos para incubação e pintos do dia","Proposta de certificado enviada às autoridades do país\nAguarda-se resposta\nExportações em curso com certificado generalista","Animal","Ovos e laticínios"]
["Em curso","Israel","Aves ornamentais","Manifestadas intenções exportadoras\nSolicitada informação sobre requisitos de importação às autoridades do país\nAguarda-se resposta","Animal","Animais vivos"]
["Resolvido","Israel","Bovinos, ovinos e caprinos vivos","Aprovada exportação de ruminantes vivos","Animal","Animais vivos",null,"2014-06-01"]
["Em curso","Israel","Cavalos","Manifestadas intenções exportadoras\nSolicitada informação sobre requisitos de importação às autoridades do país\nAguarda-se resposta","Animal","Animais vivos"]
["Resolvido","Israel","Peixes e gâmetas","Acordado certificado e respetivas condições sanitárias para início de exportação","Animal","Animais vivos",null,"2011-12-01"]
["Resolvido","Israel","Peixes ornamentais","Acordado certificado e respetivas condições sanitárias para início de exportação","Animal","Animais vivos",null,"2011-12-01"]
["Em curso","Israel","Proteinas animais de aves, transformadas","Enviada proposta de acordo escrito para exportação (ao abrigo do Reg (CE) nº 999/2001)\nAguarda-se resposta","Animal","Outros produtos animais"]
["Em curso","Japão","Carne de aves","Proposta de Certificado enviada às autoridades do país\nAguarda-se resposta","Animal","Carnes"]
["Resolvido","Japão","Carne, visceras e produtos cárneos de suino","Acordado certificado e respetivas condições sanitárias para início de exportação","Animal","Carnes",null,"2013-12-01"]
["Em curso","Japão","Cereja","Processo de habilitação para a exportação em curso\nResposta ao questionário enviada às autoridades do país\nAguarda-se resposta","Vegetal","Frutas",null,null,null,"2015-02-20"]
["Em curso","Japão","Laticínios","Não existe certificado acordado\nExportações em curso com certificado generalista","Animal","Ovos e laticínios"]
["Em curso","Japão","Vinho","Maior exigência recente a nível documental","Bebidas","Produtos vínicos"]
["Resolvido","Jordânia","Cães e gatos (ACSCC*) ","Acordado certificado sanitário oficial sem caráter comercial","Animal","Animais vivos",null,"2014-06-01"]
["Em curso","Jordânia","Maçã","Manifestadas intenções exportadoras\nSolicitada informação sobre requisitos de importação às autoridades do país\nAguarda-se resposta","Vegetal","Frutas",null,null,null,"2015-02-20"]
["Em curso","Jordânia","Pera","Manifestadas intenções exportadoras\nSolicitada informação sobre requisitos de importação às autoridades do país\nAguarda-se resposta","Vegetal","Frutas",null,null,null,"2015-02-20"]
["Em curso","Kuwait","Carne e produtos cárneos","Proposta de certificado enviada às autoridades do país\nAguarda-se resposta","Animal","Carnes"]
["Em curso","Kuwait","Géneros alimentícios processados","Proposta de certificado enviada às autoridades do país\nAguarda-se resposta","Preparações"]
["Em curso","Kuwait","Ovos e ovoprodutos","Proposta de certificado enviada às autoridades do país\nAguarda-se resposta","Animal","Ovos e laticínios"]
["Em curso","Kuwait","Produtos da pesca","Proposta de certificado enviada às autoridades do país\nAguarda-se resposta","Animal","Pescado"]
["Em curso","Kuwait","Laticínios","Proposta de certificado enviada às autoridades do país\nAguarda-se resposta","Animal","Ovos e laticínios"]
["Em curso","Líbano","Bovinos","Proposta de certificado enviada às autoridades do país\nAguarda-se resposta","Animal","Animais vivos"]
["Resolvido","Líbano","Cães e gatos (ACSCC*) ","Acordado certificado sanitário oficial sem caráter comercial","Animal","Animais vivos",null,"2014-06-01"]
["Resolvido","Líbano","Coelhos vivos (ACSCC*) ","Acordado certificado sanitário oficial sem caráter comercial","Animal","Animais vivos",null,"2014-06-01"]
["Em curso","Líbia","Bovinos para abate e reprodutores","Proposta de certificados para abate e reprodução enviada às autoridades do país\nResposta não satisfatória","Animal","Animais vivos"]
["Em curso","Líbia","Coelhos vivos","Manifestadas intenções exportadoras\nSolicitada informação sobre requisitos de entrada às autoridades do país\nResposta recebida\nCertificado em preparação","Animal","Animais vivos"]
["Em curso","Líbia","Ovinos e caprinos vivos para abate","Proposta de certificados para exportação enviada às autoridades do país\nResposta não satisfatória","Animal","Animais vivos"]
["Resolvido","Madagáscar","Laticínios","Acordado certificado e respetivas condições sanitárias para início de exportação","Animal","Ovos e laticínios",null,"2014-02-01"]
["Resolvido","Marrocos","Alimentos para cães e gatos","Acordado certificado e respetivas condições sanitárias para início de exportação","Animal","Outros produtos animais",null,"2014-04-01"]
["Resolvido","Marrocos","Aves ornamentais (ACSCC*) ","Acordado certificado sanitário oficial sem caráter comercial","Animal","Animais vivos",null,"2013-08-01"]
["Resolvido","Marrocos","Bovinos para engorda","Acordado certificado e respetivas condições sanitárias para início de exportação","Animal","Animais vivos",null,"2014-04-01"]
["Resolvido","Marrocos","Bovinos reprodutores","Acordado certificado e respetivas condições sanitárias para início de exportação","Animal","Animais vivos",null,"2014-02-01"]
["Resolvido","Marrocos","Cães e gatos (ACSCC*) ","Acordado certificado sanitário oficial sem caráter comercial","Animal","Animais vivos",null,"2013-01-01"]
["Resolvido","Marrocos","Carne e produtos cárneos de bovino","Acordado certificado e respetivas condições sanitárias para início de exportação (incluindo carne picada)","Animal","Animais vivos",null,"2014-09-01"]
["Resolvido","Marrocos","Ovinos e caprinos reprodutores","Acordado certificado e respetivas condições sanitárias para início de exportação","Animal","Animais vivos",null,"2014-09-01"]
["Resolvido","Marrocos","Tripas de ruminantes","Acordado certificado e respetivas condições sanitárias para início de exportação",null,null,null,"2015-01-01",null,"2016-02-08"]
["Resolvido","Marrocos","Carne e produtos cárneos de suíno","Acordado certificado e respetivas condições sanitárias para início de exportação",null,null,null,"2015-01-01",null,"2016-02-08"]
["Resolvido","Marrocos","Tripas de suíno","Acordado certificado e respetivas condições sanitárias para início de exportação",null,null,null,"2015-01-01",null,"2016-02-08"]
["Resolvido","Marrocos","Produtos da pesca e da aquicultura","Acordado certificado e respetivas condições sanitárias para início de exportação","Animal","Pescado",null,"2014-02-01"]
["Em curso","Marrocos","Ovinos e caprinos para engorda e abate","Processo de habilitação para a exportação pendente","Animal","Animais vivos",null,null,null,"2016-02-08"]
["Em curso","Marrocos","Peixes ornamentais","Processo de habilitação para a exportação pendente","Animal","Animais vivos",null,null,null,"2016-02-08"]
["Resolvido","Marrocos","Pintos do dia","Acordado certificado e respetivas condições sanitárias para início de exportação","Animal","Animais vivos",null,null,null,"2016-02-08"]
["Resolvido","Marrocos","Sémen de Bovino","Acordado certificado e respetivas condições sanitárias para início de exportação","Animal","Outros produtos animais",null,null,null,"2016-02-08"]
["Resolvido","Marrocos","Ovos de Incubação","Acordado certificado e respetivas condições sanitárias para início de exportação","Animal","Ovos e laticínios",null,null,null,"2016-02-08"]
["Em curso","Marrocos","Aves de Capoeira","Processo de habilitação para a exportação em curso","Animal","Animais vivos",null,null,null,"2016-02-08"]
["Resolvido","Maurícias, Ilhas","Frutas frescas: ameixa, arando, amora, cereja, damasco, diospiro, figo, groselha, kiwi, maçã, mirtilo, morango, nectarina, pera, pêssego, uva de mesa","Estabelecidos pela Autoridade Fitossanitária das Ilhas Maurícias os requisitos fitossanitários constantes do documento anexo para exportação destes frutos da UE","Vegetal","Frutas","Condições acordadas UE-Maurícias","2015-11-01",null,"2015-11-20"]
["Em curso","México","Aves que não de capoeira","Manifestadas intenções exportadoras\nSolicitada informação sobre requisitos de importação às autoridades do país\nAguarda-se resposta","Animal","Animais vivos"]
["Resolvido","México","Cavalos","Acordado certificado e respetivas condições sanitárias para início de exportação","Animal","Animais vivos",null,"2013-02-01",null,"2015-07-06"]
["Em curso","México","Maçã","Processo de habilitação para a exportação em curso, com acompanhamento da Comissão Europeia\nResposta ao questionário enviada às autoridades do país\nPedido de informação complementar das autoridades do país sobre certas pragas\nAutoridades nacionais enviaram proposta de plano de ação para mitigar risco de pragas prioritárias para México (elaborada em conjunto com COTHN)\nAnálise de Risco de Pragas (ARP) em curso\nVisita técnica das autoridades do país a Portugal\nAguarda-se envio da proposta de requisitos na sequência da visita técnica de Setembro de 2015","Vegetal","Frutas",null,null,null,"2015-11-20"]
["Em curso","México","Pera","Processo de habilitação para a exportação em curso, com acompanhamento da Comissão Europeia\nResposta ao questionário enviada às autoridades do país\nPedido de informação complementar das autoridades do país sobre certas pragas\nAutoridades nacionais enviaram proposta de plano de ação para mitigar risco de pragas prioritárias para México (elaborada em conjunto com ANP e COTHN)\nAnálise de Risco de Pragas (ARP) em curso\nVisita técnica das autoridades do país a Portugal\nAguarda-se envio da proposta de requisitos na sequência da visita técnica de Setembro de 2015","Vegetal","Frutas",null,null,null,"2015-11-20"]
["Em curso","México","Produtos cárneos (suíno)","Processo de habilitação para a exportação em curso, com acompanhamento da Comissão Europeia\nResposta a questionário de habilitação remetida às autoridades do país, através da Comissão Europeia\nRealizada missão de autoridades do país a suiniculturas nacionais para habilitação de empresas \nPrevista visita para avaliação dos serviços veterinários nacionais","Animal","Carnes",null,null,null,"2015-07-06"]
["Em curso","México","Leite e laticínios","Processo de habilitação para a exportação em curso, com acompanhamento da Comissão Europeia","Animal","Ovos e laticínios",null,null,null,"2015-07-06"]
["Em curso","México","Sémen equino","Aceite proposta de certificado\nAutoridades do país deverão emitir em breve Folha de Requisitos Zoosanitários","Animal","Outros produtos animais",null,null,null,"2015-07-06"]
["Em curso","México","Vinho","A extensão do texto exigido obriga a etiquetas de grandes dimensões, o que estraga a imagem das garrafas","Bebidas","Produtos vínicos"]
["Em curso","Moçambique","Aves ornamentais (ACSCC*)","Solicitada informação sobre requisitos de entrada de animais sem carácter comercial às autoridades do país\nAguarda-se resposta","Animal","Animais vivos"]
["Resolvido","Moçambique","Bovinos","Acordado certificado e respetivas condições sanitárias para início de exportação","Animal","Animais vivos",null,"2013-01-01"]
["Resolvido","Moçambique","Caracóis vivos","Acordado certificado e respetivas condições sanitárias para início de exportação","Animal","Animais vivos",null,"2012-06-01"]
["Em curso","Moçambique","Carne de caracol","Manifestadas intenções exportadoras \nEm avaliação prioridade para início do processo","Animal","Carnes"]
["Em curso","Moçambique","Mel e produtos apícolas","Exportação exige certificação de acordo com licenças de importação\nDisponível on-line certificado aplicável","Animal","Outros produtos animais",null,"2013-12-01"]
["Resolvido","Moçambique","Laticínios","Acordado certificado e respetivas condições sanitárias para início de exportação","Animal","Ovos e laticínios",null,"2013-03-01"]
["Resolvido","Moçambique","Sémen bovino","Acordado certificado e respetivas condições sanitárias para início de exportação","Animal","Outros produtos animais",null,"2012-12-01"]
["Em curso","Moldávia","Produtos da pesca e da aquicultura","Proposta de certificado enviada às autoridades do país\nAguarda-se resposta ","Animal","Pescado"]
["Em curso","Omã","Carne e produtos cárneos","Proposta de certificado enviada às autoridades do país\nAguarda-se resposta","Animal","Carnes"]
["Em curso","Omã","Géneros alimentícios processados","Proposta de certificado enviada às autoridades do país\nAguarda-se resposta","Preparações"]
["Em curso","Omã","Ovos e ovoprodutos","Proposta de certificado enviada às autoridades do país\nAguarda-se resposta","Animal","Ovos e laticínios"]
["Em curso","Omã","Produtos da pesca","Proposta de certificado enviada às autoridades do país\nAguarda-se resposta","Animal","Pescado"]
["Em curso","Omã","Laticínios","Proposta de certificado enviada às autoridades do país\nAguarda-se resposta","Animal","Ovos e laticínios"]
["Em curso","Panamá","Maçã","Manifestadas intenções exportadoras\nSolicitada informação sobre requisitos de importação às autoridades do país\nAguarda-se resposta","Vegetal","Frutas"]
["Em curso","Panamá","Pera","Manifestadas intenções exportadoras\nSolicitada informação sobre requisitos de importação às autoridades do país\nAguarda-se resposta","Vegetal","Frutas"]
["Em curso","Panamá","Produtos de origem animal","Processo de habilitação para a exportação em curso\nQuestionário recebido das autoridades do país em fase de resposta para \"Leites\" e \"Carnes\"","Animal"]
["Em curso","Paquistão","Maçã","Manifestadas intenções exportadoras\nNecessário solicitar informação sobre requisitos de importação às autoridades do país","Vegetal","Frutas"]
["Em curso","Paquistão","Pera","Manifestadas intenções exportadoras\nNecessário solicitar informação sobre requisitos de importação às autoridades do país","Vegetal","Frutas"]
["Em curso","Paquistão","Laticínios","Proposta de certificado enviada às autoridades do país\nAguarda-se resposta","Animal","Ovos e laticínios"]
["Resolvido","Peru","Cães e gatos (ACSCC*) ","Acordado certificado sanitário oficial sem caráter comercial","Animal","Animais vivos",null,"2007-12-01","2014-02-01"]
["Resolvido","Peru","Cavalos","Acordado certificado e respetivas condições sanitárias para início de exportação","Animal","Animais vivos",null,"2013-01-01"]
["Em curso","Peru","Maçã","Processo de habilitação para a exportação em curso\nEnviada resposta a questionário às autoridades do país\nIniciada Análise de Risco de Pragas (ARP)\nVisita técnica das autoridades do país a Portugal para ultimar acordo sobre requisitos fitossanitários","Vegetal","Frutas",null,null,null,"2015-06-26"]
["Em curso","Peru","Pera","Processo de habilitação para a exportação em curso\nEnviada resposta a questionário às autoridades do país\nIniciada Análise de Risco de Pragas (ARP)\nVisita técnica das autoridades do país a Portugal para ultimar acordo sobre requisitos fitossanitários","Vegetal","Frutas",null,null,null,"2015-06-26"]
["Resolvido","Peru","Perus","Acordada alteração ao certificado de 2007","Animal","Animais vivos",null,"2007-12-01","2014-02-01"]
["Em curso","Peru","Produtos cárneos","Manifestadas intenções exportadoras\nSolicitada informação sobre requisitos de importação às autoridades do país\nAguarda-se resposta","Animal","Carnes",null,null,null,"2015-06-26"]
["Em curso","Peru","Laticínios","Manifestadas intenções exportadoras\nSolicitada informação sobre requisitos de importação às autoridades do país\nAguarda-se resposta","Animal","Ovos e laticínios",null,null,null,"2015-06-26"]
["Resolvido","República Dominicana","Cavalos","Recebida informação das autoridades do país de que é necessária licença de importação a obter pelo importador","Animal","Animais vivos"]
["Em curso","Rússia","Cães e gatos (ACSCC*) ","Enviado modelo de certificado sanitário para introdução de mais de 2 cães ou gatos sem carácter comercial\nCertificado em discussão","Animal","Animais vivos"]
["Em curso","Rússia","Carne e produtos cárneos","Enviado convite para deslocação a Portugal de peritos no âmbito da exportação de produtos de origem animal\nEnviado novo convite com proposta de data\nAguarda-se resposta","Animal","Carnes"]
["Em curso","Rússia","Cavalos","Enviado modelo de certificado sanitário  para União Aduaneira (Rússia, Bielorússia e Cazaquistão)\nAguarda-se resposta","Animal","Animais vivos"]
["Em curso","Rússia","Farinha de peixe","Enviado modelo de certificado sanitário\nAguarda-se resposta","Animal","Pescado"]
["Resolvido","Rússia","Mel","Acordado certificado e respetivas condições sanitárias para início de exportação","Animal","Outros produtos animais",null,"2013-01-01"]
["Em curso","Rússia","Ovos","Enviado aditamento à listagem de estabelecimentos habilitados a exportar\nAguardam-se clarificações","Animal","Ovos e laticínios"]
["Em curso","Rússia","Pescado","Enviado aditamento à listagem de estabelecimentos habilitados a exportar\nAutoridades russas informaram que não há aditamentos sem nova missão","Animal","Pescado"]
["Em curso","Rússia","Laticínios","Enviado aditamento à listagem de estabelecimentos habilitados a exportar\nAutoridades russas informaram que não há aditamentos sem nova missão","Animal","Ovos e laticínios"]
["Em curso","Rússia","Tripas","Enviado aditamento à listagem de estabelecimentos habilitados a exportar\nAutoridades russas informaram que não há aditamentos sem nova missão","Animal","Outros produtos animais"]
["Resolvido","São Cristovão e Nevis","Cães e gatos (ACSCC*) ","Acordado certificado sanitário oficial sem caráter comercial","Animal","Animais vivos",null,"2014-02-01"]
["Resolvido","São Tomé e Príncipe","Coelhos vivos","Acordado certificado e respetivas condições sanitárias para início de exportação","Animal","Animais vivos",null,"2012-12-01"]
["Em curso","Sérvia","Cães e gatos (ACSCC*) ","Solicitada informação sobre requisitos de entrada às autoridades do país\nAguarda-se resposta","Animal","Animais vivos"]
["Resolvido","Sérvia","Carne de aves","Acordado certificado e respetivas condições sanitárias para início de exportação","Animal","Carnes",null,"2012-12-01"]
["Resolvido","Singapura","Aves ornamentais (ACSCC*)","Acordado certificado sanitário oficial sem caráter comercial","Animal","Animais vivos",null,"2013-01-01"]
["Em curso","Singapura","Carnes","Processo de habilitação para a exportação em curso\nEnviadas respostas a questionários às autoridades do país, sem validação positiva\nAvaliação negativa em fase de contraditório por parte das autoridades portuguesas","Animal","Carnes"]
["Resolvido","Singapura","Peixes ornamentais","Não é necessário certificado para exportação","Animal","Animais vivos",null,"2013-12-20"]
["Resolvido","Síria","Aves de capoeira e pintos do dia","Acordado certificado e respetivas condições sanitárias para início de exportação ","Animal","Animais vivos",null,"2011-12-01"]
["Em curso","Sri Lanka","Cães (ACSCC*) ","Solicitada informação sobre requisitos de entrada às autoridades do país\nAguarda-se resposta","Animal","Animais vivos"]
["Resolvido","Tailândia","Lémures","Acordado certificado e respetivas condições sanitárias para início de exportação","Animal","Animais vivos",null," 31-12-2013"]
["Em curso","Tailândia","Pera","Manifestadas intenções exportadoras \nEm avaliação prioridade para início do processo","Vegetal","Frutas"]
["Em curso","Tailândia","Subprodutos de origem animal destinados a alimentos para animais","Celebrado acordo bilateral com autoridades do país\nAguarda-se aprovação pelo Parlamento tailandês","Animal","Outros produtos animais"]
["Em curso","Taiwan","Aves de capoeira e ornamentais","Processo de habilitação para a exportação em curso\nEnviada resposta a questionário  às autoridades do país, assim como declaração garantindo que Portugal está livre de Gripe Aviária \nAguarda-se resposta","Animal","Animais vivos"]
["Em curso","Taiwan","Maçã","Processo de habilitação para a exportação em curso\nAs autoridades do país enviaram questionário e solicitaram a identificação da fruta prioritária\nResposta a questionário enviada indicando pera","Vegetal","Frutas",null,null,null,"2015-02-20"]
["Em curso","Taiwan","Pera","Processo de habilitação para a exportação em curso\nAs autoridades do país enviaram questionário e solicitaram a identificação da fruta prioritária\nResposta a questionário enviada indicando pera","Vegetal","Frutas",null,null,null,"2015-02-20"]
["Em curso","Timor Leste","Cães e gatos (ACSCC*) ","Solicitada informação sobre requisitos de entrada de animais às autoridades do país\nAguarda-se resposta","Animal","Animais vivos"]
["Em curso","Tunísia","Bovinos","Proposta de certificado enviada às autoridades do país\nAguarda-se resposta","Animal","Animais vivos",null,null,null,"2016-02-12"]
["Resolvido","Tunísia","Aves Ornamentais","Acordado certificado e respetivas condições sanitárias para início de exportação","Animal","Animais vivos",null,null,null,"2016-02-12"]
["Resolvido","Tunísia","Cavalos","Acordado certificado e respetivas condições sanitárias para início de exportação","Animal","Animais vivos",null,"2011-12-01",null,"2016-02-12"]
["Resolvido","Tunísia","Ovinos e caprinos","Acordado certificado e respetivas condições sanitárias para início de exportação","Animal","Animais vivos",null,"2013-12-01",null,"2016-02-12"]
["Resolvido","Tunísia","Ovos para incubação e pintos do dia","Acordado certificado e respetivas condições sanitárias para início de exportação","Animal","Ovos e laticínios",null,"2012-05-01",null,"2016-02-12"]
["Resolvido","Turquia","Ovos para incubação exceto ratites","Acordado certificado e respetivas condições sanitárias para início de exportação","Animal","Ovos e laticínios",null,"2011-12-01"]
["Resolvido","Turquia","Pintos do dia exceto ratites","Acordado certificado e respetivas condições sanitárias para início de exportação","Animal","Animais vivos",null,"2011-12-01"]
["Resolvido","Ucrânia","Cães e gatos (ACSCC*) ","Acordado certificado sanitário oficial sem caráter comercial","Animal","Animais vivos",null,"2013-08-01"]
["Em curso","Ucrânia","Carne e produtos cárneos de suíno","Manifestadas intenções exportadoras. UE refere dificuldades na obtenção de licenças de importação para produtos de origem animal, assim como aplicação pouco clara das normas","Animal","Carnes"]
["Em curso","Ucrânia","Cavalos","Solicitada informação sobre requisitos de importação às autoridades do país\nAguarda-se resposta","Animal","Animais vivos"]
["Resolvido","Ucrânia","Coelhos vivos (ACSCC*) ","Acordado certificado sanitário oficial sem caráter comercial","Animal","Animais vivos",null,"2013-08-01"]
["Em curso","Ucrânia","Tartarugas (ACSCC*) ","Solicitada informação sobre requisitos de entrada às autoridades do país\nAguarda-se resposta","Animal","Animais vivos"]
["Resolvido","Uganda","Pintos do dia","Acordado certificado e respetivas condições sanitárias para início de exportação","Animal","Animais vivos",null,"2011-12-01"]
["Em curso","Venezuela","Azeite","- Alteração na taxa de acesso a moeda estrangeira  (dólares ou euros): azeite tinha acesso à taxa mais baixa, mas atualmente taxa reduzida é só para produtos de primeira necessidade, o que provocou um encarecimento substancial no preço do produto.\n- Dificuldades no acesso a moeda estrangeira, por parte dos importadores de azeite (e de grande parte dos produtos): acesso passou para novo organismo, SICAD II, que o regula através de leilões específicos para cada produto, sem  calendarização clara. Estas dificuldades têm impacto direto nas exportações portuguesas.\n- Renovação dos Registos Sanitários tem de ser feita pelos importadores, de 2 em 2 anos, junto das  autoridades venezuelanas, mas processo não é simples.","Vegetal","Outros produtos vegetais"]
["Em curso","Venezuela","Maçã","Processo de habilitação para a exportação em curso.\nAutoridades do país exigem Análise de Risco e pedem mais informação \nResposta ao questionário enviada às autoridades do país\nAguarda-se resposta","Vegetal","Frutas",null,null,null,"2015-02-20"]
["Em curso","Venezuela","Pera","Processo de habilitação para a exportação em curso\nAutoridades do país exigem Análise de Risco e pedem mais informação \nResposta ao questionário enviada às autoridades do país\nAguarda-se resposta","Vegetal","Frutas",null,null,null,"2015-02-20"]
["Em curso","Venezuela","Produtos de origem animal (carnes, laticínios, pescado)","Realizada missão, com aprovação de 11 dos 13  estabelecimentos inspecionados (prazos de habilitação prorrogados até Dezembro de 2014). Deverá ocorrer nova visita de habilitação no próximo ano para renovação dos prazos de habilitação, caso contrário, poderá haver descontinuidade das exportações portuguesas.","Animal"]
["Em curso","Venezuela","Vinho","Morosidade na aprovação dos documentos necessários à comercialização do produto no país (e.g. registo sanitário demora cerca de 18 meses; pedido de atualização da imagem dos rótulos pode demorar mais de 1 ano, etc.)","Bebidas","Produtos vínicos"]
["Em curso","Vietname","Produtos de origem animal (carnes, pescado)","Processo de habilitação para a exportação em curso\nResposta a questionário enviada às autoridades do país\nSolicitados novos elementos adicionais aos quais já foi dada resposta.","Animal",null,null,null,null,"2016-07-28"]
["Em curso","Zimbabué","Cães e gatos (ACSCC*) ","Solicitada informação sobre requisitos de entrada às autoridades do país\nAguarda-se resposta","Animal","Animais vivos"]

{"sheet":"aux","index":3,"n_rows":136,"n_cols":17,"rows_kept":136,"cut":false,"hidden":true,"merged":[]}
["Tipo de produto",null,null,null,"Habilitação para a exportação (resumida)",null,null,null,"Habilitação para a exportação - Animais",null,null,null,null,"Voltar"]
[null,"Todos",null,null,null,null,null,null,1,"Manifestação de intenções exportadoras"]
["ANI","Animal",null,null,"1. Manifestação de intenção export",null,null,null,2,"AN contactam APD para obterem requisitos de importação"]
["VEG","Vegetal",null,null,"2. AN contacta APD para obter requisitos",null,null,null,3,"APD envia requisitos de importação que poderão permitir emissão do certificado e início da exportação. Ou APD considera que não dispõe de informação suficiente e dá início ao processo de habilitação para a exportação, que pode implicar resposta a questionário. "]
["PREP","Preparações",null,null,"3. APD envia requisitos ou questionário",null,null,null,4,"Resposta das AN; poderá ainda ser solicitada informação adicional e/ou realizar-se missão técnica"]
["BEB","Bebidas",null,null,"4. Resposta da AN",null,null,null,5,"Missão técnica ou pedido de informação adicional por parte das APD"]
[null,null,null,null,"5. APD pede mais informação ou efetua missão técnica",null,null,null,6,"Resposta das APD: relatório missão técnica ou reação a informação adicional"]
[null,null,null,null,"6. Resposta da AN ou da APD",null,null,null,7,"Concluídas as negociações, são celebrados acordos de exportação e é emitido o certificado"]
[null,"Situação",null,null,"7. Negociação do certificado",null,null,null,8,"Início da exportação"]
[null,"Todos"]
["Em curso","Em curso",null,null,null,null,null,null,"Habilitação para a exportação - Vegetais"]
["Resolvido","Resolvido",null,null,null,null,null,null,1,"Manifestação de intenções exportadoras"]
[null,null,"Todos",null,null,null,null,null,2,"AN contactam APD para obterem requisitos de importação"]
[null,null,"Animais vivos",null,"Respostas das caixas de seleção",null,null,null,3,"APD envia requisitos de importação que poderão permitir emissão do certificado e início da exportação. Ou APD considera que não dispõe de informação suficiente e dá início ao processo de habilitação para a exportação, que inclui normalmente Análise de Risco de Pragas (ARP) e eventualmente resposta a questionário. "]
[null,null,"Carnes","Estado",1,{"$f":"+INDEX(B10:B12,E15)","v":"Todos"},null,null,4,"Resposta das AN; poderá ainda ser solicitada informação adicional e/ou realizar-se uma missão técnica"]
[null,null,"Pescado","País",1,{"$f":"+INDEX(G26:G150,E16)","v":"Todos"},null,null,5,"APD inicia ARP"]
[null,null,"Ovos e laticínios","Tipo de produto",1,{"$f":"+INDEX(B2:B6,E17)","v":"Todos"},{"$f":"INDEX(A2:A6,E17)","v":0},null,6,"Com base na ARP, APD estabelece proposta de requisitos fitossanitários à importação"]
[null,null,"Preparações animais","Subtipo de produto",1,{"$f":"+INDEX(C13:C25,E18)","v":"Todos"},null,null,7,"Negociação e estabelecimento dos requisitos fitossanitários à importação"]
[null,null,"Outros produtos animais","Produto",1,{"$f":"+INDEX(O27:O135,E19)","v":"Todos"},null,null,8,"Início da exportação"]
[null,null,"Frutas"]
[null,null,"Hortícolas",null,null,null,null,null,"APD","Autoridades competentes do país de destino"]
[null,null,"Preparações vegetais",null,null,null,null,null,"AN","Autoridades nacionais"]
[null,null,"Outros produtos vegetais"]
[null,null,"Produtos vínicos"]
["Subtipo de produto",null,"Outras bebidas",null,null,null,"Lista de Países",null,"Lista de Produtos"]
[null,"Todos",null,null,null,null,"Todos",null,"Todos"]
["ANI","Animais vivos",null,null,null,null,"África do Sul",null,"Alimentos para cães e gatos","ANI","Outros produtos animais",null,null,null,"Todos"]
["ANI","Carnes",null,null,null,null,"Albânia",null,"Ameixa","VEG","Frutas",null,null,null,"Alimentos para cães e gatos","ANI","Outros produtos animais"]
["ANI","Pescado",null,null,null,null,"Angola",null,"Animais aquáticos vivos para consumo humano","ANI","Animais vivos",null,null,null,"Ameixa","VEG","Frutas"]
["ANI","Ovos e laticínios",null,null,null,null,"Arábia Saudita",null,"Arroz (baby rice)","VEG","Outros produtos vegetais",null,null,null,"Animais aquáticos vivos para consumo humano","ANI","Animais vivos"]
["PREP","Preparações animais",null,null,null,null,"Argélia",null,"Aves de capoeira","ANI","Animais vivos",null,null,null,"Arroz (baby rice)","VEG","Outros produtos vegetais"]
["ANI","Outros produtos animais",null,null,null,null,"Argentina",null,"Aves de capoeira e ornamentais","ANI","Animais vivos",null,null,null,"Aves de capoeira","ANI","Animais vivos"]
["VEG","Frutas",null,null,null,null,"Arménia",null,"Aves de capoeira e pintos do dia","ANI","Animais vivos",null,null,null,"Aves de capoeira e ornamentais","ANI","Animais vivos"]
["VEG","Hortícolas",null,null,null,null,"Austrália",null,"Aves ornamentais","ANI","Animais vivos",null,null,null,"Aves de capoeira e pintos do dia","ANI","Animais vivos"]
["PREP","Preparações vegetais",null,null,null,null,"Bahamas",null,"Aves ornamentais (ACSCC*) ","ANI","Animais vivos",null,null,null,"Aves ornamentais","ANI","Animais vivos"]
["VEG","Outros produtos vegetais",null,null,null,null,"Bahrain",null,"Aves que não de capoeira","ANI","Animais vivos",null,null,null,"Aves ornamentais (ACSCC*) ","ANI","Animais vivos"]
["BEB","Produtos vínicos",null,null,null,null,"Benim",null,"Azeite","VEG","Outros produtos vegetais",null,null,null,"Aves que não de capoeira","ANI","Animais vivos"]
["BEB","Outras bebidas",null,null,null,null,"Bolívia",null,"Bovinos","ANI","Animais vivos",null,null,null,"Azeite","VEG","Outros produtos vegetais"]
[null,null,null,null,null,null,"Bósnia e Herzegovina",null,"Bovinos (incluindo animais vivos para criação)","ANI","Animais vivos",null,null,null,"Bovinos","ANI","Animais vivos"]
[null,null,null,null,null,null,"Brasil",null,"Bovinos para abate e reprodutores","ANI","Animais vivos",null,null,null,"Bovinos (incluindo animais vivos para criação)","ANI","Animais vivos"]
[null,null,null,null,null,null,"Cabo Verde",null,"Bovinos para engorda","ANI","Animais vivos",null,null,null,"Bovinos para abate e reprodutores","ANI","Animais vivos"]
[null,null,null,null,null,null,"Camarões",null,"Bovinos para engorda / abate","ANI","Animais vivos",null,null,null,"Bovinos para engorda","ANI","Animais vivos"]
[null,null,null,null,null,null,"Canadá",null,"Bovinos reprodutores","ANI","Animais vivos",null,null,null,"Bovinos para engorda / abate","ANI","Animais vivos"]
[null,null,null,null,null,null,"Catar",null,"Bovinos, ovinos e caprinos vivos","ANI","Animais vivos",null,null,null,"Bovinos reprodutores","ANI","Animais vivos"]
[null,null,null,null,null,null,"Chile",null,"Cães (ACSCC*) ","ANI","Animais vivos",null,null,null,"Bovinos, ovinos e caprinos vivos","ANI","Animais vivos"]
[null,null,null,null,null,null,"China",null,"Cães e gatos (ACSCC*) ","ANI","Animais vivos",null,null,null,"Cães (ACSCC*) ","ANI","Animais vivos"]
[null,null,null,null,null,null,"Colômbia",null,"Canários","ANI","Animais vivos",null,null,null,"Cães e gatos (ACSCC*) ","ANI","Animais vivos"]
[null,null,null,null,null,null,"Coreia do Sul",null,"Canários (ACSCC*) ","ANI","Animais vivos",null,null,null,"Canários","ANI","Animais vivos"]
[null,null,null,null,null,null,"Costa do Marfim",null,"Caracóis vivos","ANI","Animais vivos",null,null,null,"Canários (ACSCC*) ","ANI","Animais vivos"]
[null,null,null,null,null,null,"Costa Rica",null,"Caracóis vivos para consumo humano","ANI","Animais vivos",null,null,null,"Caracóis vivos","ANI","Animais vivos"]
[null,null,null,null,null,null,"Cuba",null,"Carne de aves","ANI","Carnes",null,null,null,"Caracóis vivos para consumo humano","ANI","Animais vivos"]
[null,null,null,null,null,null,"Egito",null,"Carne de caracol","ANI","Carnes",null,null,null,"Carne de aves","ANI","Carnes"]
[null,null,null,null,null,null,"Emirados Árabes Unidos",null,"Carne de suíno","ANI","Carnes",null,null,null,"Carne de caracol","ANI","Carnes"]
[null,null,null,null,null,null,"Equador",null,"Carne e produtos cárneos","ANI","Carnes",null,null,null,"Carne de suíno","ANI","Carnes"]
[null,null,null,null,null,null,"Estados Unidos da América",null,"Carne e produtos cárneos de aves","ANI","Carnes",null,null,null,"Carne e produtos cárneos","ANI","Carnes"]
[null,null,null,null,null,null,"Filipinas",null,"Carne e produtos cárneos de bovino","ANI","Carnes",null,null,null,"Carne e produtos cárneos de aves","ANI","Carnes"]
[null,null,null,null,null,null,"Gabão",null,"Carne e produtos cárneos de coelho","ANI","Carnes",null,null,null,"Carne e produtos cárneos de bovino","ANI","Carnes"]
[null,null,null,null,null,null,"Geórgia",null,"Carne e produtos cárneos de ovinos e caprinos","ANI","Carnes",null,null,null,"Carne e produtos cárneos de coelho","ANI","Carnes"]
[null,null,null,null,null,null,"Guatemala",null,"Carne e produtos cárneos de ruminantes","ANI","Carnes",null,null,null,"Carne e produtos cárneos de ovinos e caprinos","ANI","Carnes"]
[null,null,null,null,null,null,"Guiné Equatorial",null,"Carne e produtos cárneos de suíno","ANI","Carnes",null,null,null,"Carne e produtos cárneos de ruminantes","ANI","Carnes"]
[null,null,null,null,null,null,"Índia",null,"Carne, visceras e produtos cárneos de suino","ANI","Carnes",null,null,null,"Carne e produtos cárneos de suíno","ANI","Carnes"]
[null,null,null,null,null,null,"Indonésia",null,"Carnes","ANI","Carnes",null,null,null,"Carne, visceras e produtos cárneos de suino","ANI","Carnes"]
[null,null,null,null,null,null,"Irão",null,"Carnes frescas de leporídeos","ANI","Carnes",null,null,null,"Carnes","ANI","Carnes"]
[null,null,null,null,null,null,"Iraque",null,"Carnes transformadas","ANI","Carnes",null,null,null,"Carnes frescas de leporídeos","ANI","Carnes"]
[null,null,null,null,null,null,"Israel",null,"Cavalos","ANI","Animais vivos",null,null,null,"Carnes transformadas","ANI","Carnes"]
[null,null,null,null,null,null,"Japão",null,"Cereja","VEG","Frutas",null,null,null,"Cavalos","ANI","Animais vivos"]
[null,null,null,null,null,null,"Jordânia",null,"Citrinos","VEG","Frutas",null,null,null,"Cereja","VEG","Frutas"]
[null,null,null,null,null,null,"Kuwait",null,"Coelhos vivos","ANI","Animais vivos",null,null,null,"Citrinos","VEG","Frutas"]
[null,null,null,null,null,null,"Líbano",null,"Coelhos vivos (ACSCC*) ","ANI","Animais vivos",null,null,null,"Coelhos vivos","ANI","Animais vivos"]
[null,null,null,null,null,null,"Líbia",null,"Conservas de pescado","ANI","Pescado",null,null,null,"Coelhos vivos (ACSCC*) ","ANI","Animais vivos"]
[null,null,null,null,null,null,"Madagáscar",null,"Dióspiro","VEG","Frutas",null,null,null,"Conservas de pescado","ANI","Pescado"]
[null,null,null,null,null,null,"Marrocos",null,"Embriões de bovino","ANI","Outros produtos animais",null,null,null,"Dióspiro","VEG","Frutas"]
[null,null,null,null,null,null,"Maurícias, Ilhas",null,"Falcões","ANI","Animais vivos",null,null,null,"Embriões de bovino","ANI","Outros produtos animais"]
[null,null,null,null,null,null,"México",null,"Farinha de peixe","ANI","Pescado",null,null,null,"Falcões","ANI","Animais vivos"]
[null,null,null,null,null,null,"Moçambique",null,"Figo seco","VEG","Frutas",null,null,null,"Farinha de peixe","ANI","Pescado"]
[null,null,null,null,null,null,"Moldávia",null,"Frutas frescas: ameixa, arando, amora, cereja, damasco, diospiro, figo, groselha, kiwi, maçã, mirtilo, morango, nectarina, pera, pêssego, uva de mesa","VEG","Frutas",null,null,null,"Figo seco","VEG","Frutas"]
[null,null,null,null,null,null,"Omã",null,"Frutas frescas: ameixa, maçã, pera, pêssego e uva de mesa ","VEG","Frutas",null,null,null,"Frutas frescas: ameixa, arando, amora, cereja, damasco, diospiro, figo, groselha, kiwi, maçã, mirtilo, morango, nectarina, pera, pêssego, uva de mesa","VEG","Frutas"]
[null,null,null,null,null,null,"Panamá",null,"Géneros alimentícios processados","PREP",null,null,null,null,"Frutas frescas: ameixa, maçã, pera, pêssego e uva de mesa ","VEG","Frutas"]
[null,null,null,null,null,null,"Paquistão",null,"Kiwi","VEG","Frutas",null,null,null,"Géneros alimentícios processados","PREP"]
[null,null,null,null,null,null,"Peru",null,"Laticínios","ANI","Ovos e laticínios",null,null,null,"Kiwi","VEG","Frutas"]
[null,null,null,null,null,null,"República Dominicana",null,"Laticínios (fórmulas infantis - \"papas\")","ANI","Ovos e laticínios",null,null,null,"Laticínios","ANI","Ovos e laticínios"]
[null,null,null,null,null,null,"Rússia",null,"Leite e laticínios","ANI","Ovos e laticínios",null,null,null,"Laticínios (fórmulas infantis - \"papas\")","ANI","Ovos e laticínios"]
[null,null,null,null,null,null,"São Cristovão e Nevis",null,"Leite e laticínios (exceto fórmulas infantis) ","ANI","Ovos e laticínios",null,null,null,"Leite e laticínios","ANI","Ovos e laticínios"]
[null,null,null,null,null,null,"São Tomé e Príncipe",null,"Lémures","ANI","Animais vivos",null,null,null,"Leite e laticínios (exceto fórmulas infantis) ","ANI","Ovos e laticínios"]
[null,null,null,null,null,null,"Sérvia",null,"Maçã","VEG","Frutas",null,null,null,"Lémures","ANI","Animais vivos"]
[null,null,null,null,null,null,"Singapura",null,"Maionese","PREP","Preparações animais",null,null,null,"Maçã","VEG","Frutas"]
[null,null,null,null,null,null,"Síria",null,"Mel","ANI","Outros produtos animais",null,null,null,"Maionese","PREP","Preparações animais"]
[null,null,null,null,null,null,"Sri Lanka",null,"Mel e produtos apícolas","ANI","Outros produtos animais",null,null,null,"Mel","ANI","Outros produtos animais"]
[null,null,null,null,null,null,"Tailândia",null,"Morango","VEG","Frutas",null,null,null,"Mel e produtos apícolas","ANI","Outros produtos animais"]
[null,null,null,null,null,null,"Taiwan",null,"Nectarinas","VEG","Frutas",null,null,null,"Morango","VEG","Frutas"]
[null,null,null,null,null,null,"Timor Leste",null,"Ovinos e caprinos","ANI","Animais vivos",null,null,null,"Nectarinas","VEG","Frutas"]
[null,null,null,null,null,null,"Tunísia",null,"Ovinos e caprinos para engorda e abate","ANI","Animais vivos",null,null,null,"Ovinos e caprinos","ANI","Animais vivos"]
[null,null,null,null,null,null,"Turquia",null,"Ovinos e caprinos reprodutores","ANI","Animais vivos",null,null,null,"Ovinos e caprinos para engorda e abate","ANI","Animais vivos"]
[null,null,null,null,null,null,"Ucrânia",null,"Ovinos e caprinos vivos para abate","ANI","Animais vivos",null,null,null,"Ovinos e caprinos reprodutores","ANI","Animais vivos"]
[null,null,null,null,null,null,"Uganda",null,"Ovos","ANI","Ovos e laticínios",null,null,null,"Ovinos e caprinos vivos para abate","ANI","Animais vivos"]
[null,null,null,null,null,null,"Venezuela",null,"Ovos e ovoprodutos","ANI","Ovos e laticínios",null,null,null,"Ovos","ANI","Ovos e laticínios"]
[null,null,null,null,null,null,"Vietname",null,"Ovos para incubação","ANI","Ovos e laticínios",null,null,null,"Ovos e ovoprodutos","ANI","Ovos e laticínios"]
[null,null,null,null,null,null,"Zimbabué",null,"Ovos para incubação (galinha e pata)","ANI","Ovos e laticínios",null,null,null,"Ovos para incubação","ANI","Ovos e laticínios"]
[null,null,null,null,null,null,null,null,"Ovos para incubação e pintos do dia","ANI","Ovos e laticínios",null,null,null,"Ovos para incubação (galinha e pata)","ANI","Ovos e laticínios"]
[null,null,null,null,null,null,null,null,"Ovos para incubação exceto ratites","ANI","Ovos e laticínios",null,null,null,"Ovos para incubação e pintos do dia","ANI","Ovos e laticínios"]
[null,null,null,null,null,null,null,null,"Peixes e gâmetas","ANI","Animais vivos",null,null,null,"Ovos para incubação exceto ratites","ANI","Ovos e laticínios"]
[null,null,null,null,null,null,null,null,"Peixes ornamentais","ANI","Animais vivos",null,null,null,"Peixes e gâmetas","ANI","Animais vivos"]
[null,null,null,null,null,null,null,null,"Peixes vivos","ANI","Animais vivos",null,null,null,"Peixes ornamentais","ANI","Animais vivos"]
[null,null,null,null,null,null,null,null,"Penas e plumas","ANI","Outros produtos animais",null,null,null,"Peixes vivos","ANI","Animais vivos"]
[null,null,null,null,null,null,null,null,"Pera","VEG","Frutas",null,null,null,"Penas e plumas","ANI","Outros produtos animais"]
[null,null,null,null,null,null,null,null,"Perus","ANI","Animais vivos",null,null,null,"Pera","VEG","Frutas"]
[null,null,null,null,null,null,null,null,"Pescado","ANI","Pescado",null,null,null,"Perus","ANI","Animais vivos"]
[null,null,null,null,null,null,null,null,"Pêssego e nectarina","VEG","Frutas",null,null,null,"Pescado","ANI","Pescado"]
[null,null,null,null,null,null,null,null,"Pintos do dia","ANI","Animais vivos",null,null,null,"Pêssego e nectarina","VEG","Frutas"]
[null,null,null,null,null,null,null,null,"Pintos do dia exceto ratites","ANI","Animais vivos",null,null,null,"Pintos do dia","ANI","Animais vivos"]
[null,null,null,null,null,null,null,null,"Pombos correio","ANI","Animais vivos",null,null,null,"Pintos do dia exceto ratites","ANI","Animais vivos"]
[null,null,null,null,null,null,null,null,"Porquinhos da Índia (ACSCC*)","ANI","Animais vivos",null,null,null,"Pombos correio","ANI","Animais vivos"]
[null,null,null,null,null,null,null,null,"Produtos cárneos","ANI","Carnes",null,null,null,"Porquinhos da Índia (ACSCC*)","ANI","Animais vivos"]
[null,null,null,null,null,null,null,null,"Produtos cárneos (aves e suínos)","ANI","Carnes",null,null,null,"Produtos cárneos","ANI","Carnes"]
[null,null,null,null,null,null,null,null,"Produtos cárneos (suíno)","ANI","Carnes",null,null,null,"Produtos cárneos (aves e suínos)","ANI","Carnes"]
[null,null,null,null,null,null,null,null,"Produtos da pesca","ANI","Pescado",null,null,null,"Produtos cárneos (suíno)","ANI","Carnes"]
[null,null,null,null,null,null,null,null,"Produtos da pesca e da aquicultura","ANI","Pescado",null,null,null,"Produtos da pesca","ANI","Pescado"]
[null,null,null,null,null,null,null,null,"Produtos de origem animal","ANI","Outros produtos animais",null,null,null,"Produtos da pesca e da aquicultura","ANI","Pescado"]
[null,null,null,null,null,null,null,null,"Produtos de origem animal (carnes, laticínios, pescado)","ANI",null,null,null,null,"Produtos de origem animal","ANI","Outros produtos animais"]
[null,null,null,null,null,null,null,null,"Produtos de origem animal (carnes, pescado)","ANI",null,null,null,null,"Produtos de origem animal (carnes, laticínios, pescado)","ANI"]
[null,null,null,null,null,null,null,null,"Produtos de origem animal aquática","ANI","Outros produtos animais",null,null,null,"Produtos de origem animal (carnes, pescado)","ANI"]
[null,null,null,null,null,null,null,null,"Proteinas animais de aves, transformadas","ANI","Outros produtos animais",null,null,null,"Produtos de origem animal aquática","ANI","Outros produtos animais"]
[null,null,null,null,null,null,null,null,"Répteis","ANI","Animais vivos",null,null,null,"Proteinas animais de aves, transformadas","ANI","Outros produtos animais"]
[null,null,null,null,null,null,null,null,"Roedores","ANI","Animais vivos",null,null,null,"Répteis","ANI","Animais vivos"]
[null,null,null,null,null,null,null,null,"Sémen bovino","ANI","Outros produtos animais",null,null,null,"Roedores","ANI","Animais vivos"]
[null,null,null,null,null,null,null,null,"Sémen canino","ANI","Outros produtos animais",null,null,null,"Sémen bovino","ANI","Outros produtos animais"]
[null,null,null,null,null,null,null,null,"Sémen equino","ANI","Outros produtos animais",null,null,null,"Sémen canino","ANI","Outros produtos animais"]
[null,null,null,null,null,null,null,null,"Sémen suíno","ANI","Outros produtos animais",null,null,null,"Sémen equino","ANI","Outros produtos animais"]
[null,null,null,null,null,null,null,null,"Subprodutos de origem animal destinados a alimentos para animais","ANI","Outros produtos animais",null,null,null,"Sémen suíno","ANI","Outros produtos animais"]
[null,null,null,null,null,null,null,null,"Subprodutos de origem animal destinados a alimentos para animais (carne e ossos)","ANI","Outros produtos animais",null,null,null,"Subprodutos de origem animal destinados a alimentos para animais","ANI","Outros produtos animais"]
[null,null,null,null,null,null,null,null,"Suínos vivos","ANI","Animais vivos",null,null,null,"Subprodutos de origem animal destinados a alimentos para animais (carne e ossos)","ANI","Outros produtos animais"]
[null,null,null,null,null,null,null,null,"Tartarugas (ACSCC*) ","ANI","Animais vivos",null,null,null,"Suínos vivos","ANI","Animais vivos"]
[null,null,null,null,null,null,null,null,"Tripas","ANI","Outros produtos animais",null,null,null,"Tartarugas (ACSCC*) ","ANI","Animais vivos"]
[null,null,null,null,null,null,null,null,"Uva de mesa","VEG","Frutas",null,null,null,"Tripas","ANI","Outros produtos animais"]
[null,null,null,null,null,null,null,null,"Vinho","BEB","Produtos vínicos",null,null,null,"Uva de mesa","VEG","Frutas"]
[null,null,null,null,null,null,null,null,null,null,null,null,null,null,"Vinho","BEB","Produtos vínicos"]